Build #223

Build plan for MS Windows

Build: #223 failed

Job: Default Job failed

Stages & jobs

  1. Default Stage

Job result summary

Completed
Duration
3 minutes
Agent
bamboo-2k16-02
Revision
7a775cf2d583fa01b4922fabc5ebf9183ac90246 7a775cf2d583fa01b4922fabc5ebf9183ac90246
Total tests
1917
Fixed in
#224 (Code changes detected)

Tests

  • 1,917 tests in total
  • 1 test failed
  • 1 failure is new
  • 7 tests were quarantined / skipped
  • 46 seconds taken in total.
New test failures 1
Status Test Duration
Collapse Failed JsrSplitParsingTests test History
< 1 sec
java.lang.AssertionError: java.lang.AssertionError: expected:<COMPLETED> but was:<FAILED>
java.lang.AssertionError: expected:<COMPLETED> but was:<FAILED>
	at org.junit.Assert.fail(Assert.java:89)
	at org.junit.Assert.failNotEquals(Assert.java:835)
	at org.junit.Assert.assertEquals(Assert.java:120)
	at org.junit.Assert.assertEquals(Assert.java:146)
	at org.springframework.batch.core.jsr.configuration.xml.JsrSplitParsingTests.test(JsrSplitParsingTests.java:49)
	at sun.reflect.NativeMethodAccessorImpl.invoke0(Native Method)
(48 more lines...)

Error summary

The build generated some errors. See the full build log for more details.

May 25, 2020 9:16:21 PM uri:classloader:/gems/asciidoctor-2.0.10/lib/asciidoctor/abstract_block.rb content
INFO: possible invalid reference: providing-feedback-with-informational-messages
May 25, 2020 9:16:21 PM uri:classloader:/gems/asciidoctor-2.0.10/lib/asciidoctor/abstract_block.rb content
INFO: possible invalid reference: asynchronous-processors
May 25, 2020 9:16:21 PM uri:classloader:/gems/asciidoctor-2.0.10/lib/asciidoctor/abstract_block.rb content
INFO: possible invalid reference: externalizing-batch-process-execution
May 25, 2020 9:16:21 PM uri:classloader:/gems/asciidoctor-2.0.10/lib/asciidoctor/abstract_block.rb content
INFO: possible invalid reference: metaDataVersion
May 25, 2020 9:16:21 PM uri:classloader:/gems/asciidoctor-2.0.10/lib/asciidoctor/abstract_block.rb content
INFO: possible invalid reference: metaDataVersion
May 25, 2020 9:16:21 PM uri:classloader:/gems/asciidoctor-2.0.10/lib/asciidoctor/abstract_block.rb content
INFO: possible invalid reference: metaDataVersion
May 25, 2020 9:16:21 PM uri:classloader:/gems/asciidoctor-2.0.10/lib/asciidoctor/abstract_block.rb content
INFO: possible invalid reference: transactionsNoRetry
May 25, 2020 9:16:21 PM uri:classloader:/gems/asciidoctor-2.0.10/lib/asciidoctor/abstract_block.rb content
INFO: possible invalid reference: repeatRetry
May 25, 2020 9:16:21 PM uri:classloader:/gems/asciidoctor-2.0.10/lib/asciidoctor/abstract_block.rb content
INFO: possible invalid reference: repeatRetry
May 25, 2020 9:16:21 PM uri:classloader:/gems/asciidoctor-2.0.10/lib/asciidoctor/converter/html5.rb convert_document
INFO: possible invalid reference: jobParameters
May 25, 2020 9:16:21 PM uri:classloader:/gems/asciidoctor-2.0.10/lib/asciidoctor/parser.rb parse
WARNING: jsr-352.adoc: line 618: unterminated table block
May 25, 2020 9:16:21 PM uri:classloader:/gems/asciidoctor-2.0.10/lib/asciidoctor/parser.rb next_block
SEVERE: jsr-352.adoc: line 622: table missing leading separator; recovering automatically
C:\opt\bamboo-home\xml-data\build-dir\BATCH-BATCHWIN-JOB1\spring-batch-infrastructure\src\main\java\org\springframework\batch\item\avro\builder\AvroItemReaderBuilder.java:104: warning: no @return
        public AvroItemReaderBuilder<T> embeddedSchema(boolean embeddedSchema) {
                                        ^
C:\Windows\System32\config\systemprofile\.gradle\caches\modules-2\files-2.1\org.springframework\spring-core\5.3.0-SNAPSHOT\3e45eec31984044e817dfe112fbf95a0e2f47347\spring-core-5.3.0-SNAPSHOT.jar(org/springframework/lang/Nullable.class): warning: Cannot find annotation method 'when()' in type 'Nonnull': class file for javax.annotation.Nonnull not found
warning: unknown enum constant When.MAYBE
  reason: class file for javax.annotation.meta.When not found
C:\Windows\System32\config\systemprofile\.gradle\caches\modules-2\files-2.1\org.springframework\spring-core\5.3.0-SNAPSHOT\3e45eec31984044e817dfe112fbf95a0e2f47347\spring-core-5.3.0-SNAPSHOT.jar(org/springframework/lang/NonNullApi.class): warning: Cannot find annotation method 'value()' in type 'TypeQualifierDefault': class file for javax.annotation.meta.TypeQualifierDefault not found
3 warnings
warning: unknown enum constant When.MAYBE
  reason: class file for javax.annotation.meta.When not found
C:\opt\bamboo-home\xml-data\build-dir\BATCH-BATCHWIN-JOB1\spring-batch-core\src\test\java\org\springframework\batch\core\resource\ListPreparedStatementSetterTests.java:37: warning: [deprecation] ListPreparedStatementSetter in org.springframework.batch.item.database.support has been deprecated
import org.springframework.batch.item.database.support.ListPreparedStatementSetter;
                                                      ^
C:\opt\bamboo-home\xml-data\build-dir\BATCH-BATCHWIN-JOB1\spring-batch-core\src\test\java\org\springframework\batch\core\configuration\annotation\JobScopeConfigurationTests.java:61: warning: [deprecation] none() in ExpectedException has been deprecated
        public ExpectedException expected = ExpectedException.none();
                                                             ^
C:\opt\bamboo-home\xml-data\build-dir\BATCH-BATCHWIN-JOB1\spring-batch-core\src\test\java\org\springframework\batch\core\configuration\annotation\StepScopeConfigurationTests.java:59: warning: [deprecation] none() in ExpectedException has been deprecated
        public ExpectedException expected = ExpectedException.none();
                                                             ^
C:\opt\bamboo-home\xml-data\build-dir\BATCH-BATCHWIN-JOB1\spring-batch-core\src\test\java\org\springframework\batch\core\JobParametersBuilderTests.java:63: warning: [deprecation] none() in ExpectedException has been deprecated
        public ExpectedException expectedException = ExpectedException.none();
                                                                      ^
C:\opt\bamboo-home\xml-data\build-dir\BATCH-BATCHWIN-JOB1\spring-batch-core\src\test\java\org\springframework\batch\core\jsr\configuration\xml\JsrSplitParsingTests.java:44: warning: [deprecation] none() in ExpectedException has been deprecated
        public ExpectedException expectedException = ExpectedException.none();
                                                                      ^
C:\opt\bamboo-home\xml-data\build-dir\BATCH-BATCHWIN-JOB1\spring-batch-core\src\test\java\org\springframework\batch\core\resource\ListPreparedStatementSetterTests.java:55: warning: [deprecation] ListPreparedStatementSetter in org.springframework.batch.item.database.support has been deprecated
        ListPreparedStatementSetter pss;
        ^
C:\opt\bamboo-home\xml-data\build-dir\BATCH-BATCHWIN-JOB1\spring-batch-core\src\test\java\org\springframework\batch\core\resource\ListPreparedStatementSetterTests.java:81: warning: [deprecation] ListPreparedStatementSetter in org.springframework.batch.item.database.support has been deprecated
                pss = new ListPreparedStatementSetter(parameters);
                          ^
C:\opt\bamboo-home\xml-data\build-dir\BATCH-BATCHWIN-JOB1\spring-batch-core\src\test\java\org\springframework\batch\core\resource\ListPreparedStatementSetterTests.java:105: warning: [deprecation] ListPreparedStatementSetter in org.springframework.batch.item.database.support has been deprecated
                pss = new ListPreparedStatementSetter(null);
                          ^
C:\opt\bamboo-home\xml-data\build-dir\BATCH-BATCHWIN-JOB1\spring-batch-core\src\test\java\org\springframework\batch\core\step\item\FaultTolerantStepFactoryBeanRollbackTests.java:137: warning: [deprecation] <T>assertThat(T,Matcher<? super T>) in Assert has been deprecated
                assertThat(e, instanceOf(FatalStepExecutionException.class));
                ^
  where T is a type-variable:
    T extends Object declared in method <T>assertThat(T,Matcher<? super T>)
C:\opt\bamboo-home\xml-data\build-dir\BATCH-BATCHWIN-JOB1\spring-batch-core\src\test\java\org\springframework\batch\core\step\item\FaultTolerantStepFactoryBeanRollbackTests.java:138: warning: [deprecation] <T>assertThat(T,Matcher<? super T>) in Assert has been deprecated
                assertThat(e.getCause(), instanceOf(IllegalArgumentException.class));
                ^
  where T is a type-variable:
    T extends Object declared in method <T>assertThat(T,Matcher<? super T>)
C:\opt\bamboo-home\xml-data\build-dir\BATCH-BATCHWIN-JOB1\spring-batch-core\src\test\java\org\springframework\batch\core\step\item\FaultTolerantStepFactoryBeanRollbackTests.java:150: warning: [deprecation] <T>assertThat(T,Matcher<? super T>) in Assert has been deprecated
                assertThat(e, instanceOf(FatalStepExecutionException.class));
                ^
  where T is a type-variable:
    T extends Object declared in method <T>assertThat(T,Matcher<? super T>)
C:\opt\bamboo-home\xml-data\build-dir\BATCH-BATCHWIN-JOB1\spring-batch-core\src\test\java\org\springframework\batch\core\step\item\FaultTolerantStepFactoryBeanRollbackTests.java:151: warning: [deprecation] <T>assertThat(T,Matcher<? super T>) in Assert has been deprecated
                assertThat(e.getCause(), instanceOf(IllegalArgumentException.class));
                ^
  where T is a type-variable:
    T extends Object declared in method <T>assertThat(T,Matcher<? super T>)
C:\opt\bamboo-home\xml-data\build-dir\BATCH-BATCHWIN-JOB1\spring-batch-core\src\test\java\org\springframework\batch\core\step\item\FaultTolerantStepFactoryBeanTests.java:84: warning: [deprecation] none() in ExpectedException has been deprecated
        public ExpectedException expectedException = ExpectedException.none();
                                                                      ^
C:\opt\bamboo-home\xml-data\build-dir\BATCH-BATCHWIN-JOB1\spring-batch-core\src\test\java\org\springframework\batch\core\step\item\SimpleStepFactoryBeanTests.java:70: warning: [deprecation] none() in ExpectedException has been deprecated
        public ExpectedException expectedException = ExpectedException.none();
                                                                      ^
14 warnings

1917 tests completed, 1 failed, 7 skipped

FAILURE: Build failed with an exception.

* What went wrong:
Execution failed for task ':spring-batch-core:test'.
> There were failing tests. See the report at: file:///C:/opt/bamboo-home/xml-data/build-dir/BATCH-BATCHWIN-JOB1/spring-batch-core/build/reports/tests/test/index.html

* Try:
Run with --stacktrace option to get the stack trace. Run with --info or --debug option to get more log output. Run with --scan to get full insights.

* Get more help at https://help.gradle.org

BUILD FAILED in 3m 6s