Build #243

Build plan for MS Windows

Build: #243 failed

Job: Default Job failed

Stages & jobs

  1. Default Stage

Job result summary

Completed
Duration
3 minutes
Agent
bamboo-2k16-02
Revision
67317e66d0cbd76666bd9b167a46ded90c483a6a 67317e66d0cbd76666bd9b167a46ded90c483a6a
Total tests
1919
Failing since
#233 (Code changes detected – )

Tests

  • 1,919 tests in total
  • 1 test failed
  • 7 tests were quarantined / skipped
  • 46 seconds taken in total.
Existing test failures 1
Status Test Failing since Duration
java.lang.AssertionError: java.lang.AssertionError
java.lang.AssertionError
	at org.junit.Assert.fail(Assert.java:87)
	at org.junit.Assert.assertTrue(Assert.java:42)
	at org.junit.Assert.assertTrue(Assert.java:53)
	at org.springframework.batch.core.jsr.partition.JsrPartitionHandlerTests.testPollingPartitionsCompletion(JsrPartitionHandlerTests.java:156)
	at sun.reflect.NativeMethodAccessorImpl.invoke0(Native Method)
	at sun.reflect.NativeMethodAccessorImpl.invoke(NativeMethodAccessorImpl.java:62)
(47 more lines...)

Error summary

The build generated some errors. See the full build log for more details.

2 warnings
C:\opt\bamboo-home\xml-data\build-dir\BATCH-BATCHWIN-JOB1\spring-batch-core\src\main\java\org\springframework\batch\core\metrics\BatchMetrics.java:73: warning - Tag @link: reference not found: Timer.Sample
C:\opt\bamboo-home\xml-data\build-dir\BATCH-BATCHWIN-JOB1\spring-batch-core\src\main\java\org\springframework\batch\core\metrics\BatchMetrics.java:73: warning - Tag @link: reference not found: Timer.Sample
C:\opt\bamboo-home\xml-data\build-dir\BATCH-BATCHWIN-JOB1\spring-batch-core\src\main\java\org\springframework\batch\core\metrics\BatchMetrics.java:73: warning - Tag @link: reference not found: Timer.Sample
Jul 24, 2020 1:18:08 PM uri:classloader:/gems/asciidoctor-pdf-1.5.0.rc.2/lib/asciidoctor/pdf/converter.rb convert_section
INFO: possible invalid reference: inheritingFromParentStep
Jul 24, 2020 1:18:11 PM uri:classloader:/gems/asciidoctor-2.0.10/lib/asciidoctor/abstract_block.rb content
INFO: possible invalid reference: jobParameters
Jul 24, 2020 1:18:44 PM uri:classloader:/gems/asciidoctor-2.0.10/lib/asciidoctor/convert.rb convert
WARNING: C:/opt/bamboo-home/xml-data/build-dir/BATCH-BATCHWIN-JOB1/build/asciidoc/assemble/footer/index-footer.adoc: stylesheet does not exist or cannot be read: C:/opt/bamboo-home/xml-data/build-dir/BATCH-BATCHWIN-JOB1/build/asciidoc/assemble/footer/spring.css
Jul 24, 2020 1:18:44 PM uri:classloader:/gems/asciidoctor-2.0.10/lib/asciidoctor/convert.rb convert
WARNING: C:/opt/bamboo-home/xml-data/build-dir/BATCH-BATCHWIN-JOB1/build/asciidoc/assemble/header/index-header.adoc: stylesheet does not exist or cannot be read: C:/opt/bamboo-home/xml-data/build-dir/BATCH-BATCHWIN-JOB1/build/asciidoc/assemble/header/spring.css
Jul 24, 2020 1:18:45 PM uri:classloader:/gems/asciidoctor-2.0.10/lib/asciidoctor/converter/html5.rb convert_section
INFO: possible invalid reference: inheritingFromParentStep
Jul 24, 2020 1:18:45 PM uri:classloader:/gems/asciidoctor-2.0.10/lib/asciidoctor/abstract_block.rb content
INFO: possible invalid reference: jobParameters
Jul 24, 2020 1:18:46 PM uri:classloader:/gems/asciidoctor-2.0.10/lib/asciidoctor/converter/html5.rb convert_document
INFO: possible invalid reference: jobParameters
C:\opt\bamboo-home\xml-data\build-dir\BATCH-BATCHWIN-JOB1\spring-batch-infrastructure\src\main\java\org\springframework\batch\item\avro\builder\AvroItemReaderBuilder.java:104: warning: no @return
        public AvroItemReaderBuilder<T> embeddedSchema(boolean embeddedSchema) {
                                        ^
C:\Windows\System32\config\systemprofile\.gradle\caches\modules-2\files-2.1\org.springframework\spring-core\5.3.0-M1\74b7587143a044647d1bdae833cd3be299244840\spring-core-5.3.0-M1.jar(org/springframework/lang/Nullable.class): warning: Cannot find annotation method 'when()' in type 'Nonnull': class file for javax.annotation.Nonnull not found
warning: unknown enum constant When.MAYBE
  reason: class file for javax.annotation.meta.When not found
C:\Windows\System32\config\systemprofile\.gradle\caches\modules-2\files-2.1\org.springframework\spring-core\5.3.0-M1\74b7587143a044647d1bdae833cd3be299244840\spring-core-5.3.0-M1.jar(org/springframework/lang/NonNullApi.class): warning: Cannot find annotation method 'value()' in type 'TypeQualifierDefault': class file for javax.annotation.meta.TypeQualifierDefault not found
3 warnings
warning: unknown enum constant When.MAYBE
  reason: class file for javax.annotation.meta.When not found
C:\opt\bamboo-home\xml-data\build-dir\BATCH-BATCHWIN-JOB1\spring-batch-core\src\test\java\org\springframework\batch\core\resource\ListPreparedStatementSetterTests.java:37: warning: [deprecation] ListPreparedStatementSetter in org.springframework.batch.item.database.support has been deprecated
import org.springframework.batch.item.database.support.ListPreparedStatementSetter;
                                                      ^
C:\opt\bamboo-home\xml-data\build-dir\BATCH-BATCHWIN-JOB1\spring-batch-core\src\test\java\org\springframework\batch\core\step\tasklet\ChunkOrientedStepIntegrationTests.java:40: warning: [deprecation] TransactionSynchronizationAdapter in org.springframework.transaction.support has been deprecated
import org.springframework.transaction.support.TransactionSynchronizationAdapter;
                                              ^
C:\opt\bamboo-home\xml-data\build-dir\BATCH-BATCHWIN-JOB1\spring-batch-core\src\test\java\org\springframework\batch\core\configuration\annotation\JobScopeConfigurationTests.java:61: warning: [deprecation] none() in ExpectedException has been deprecated
        public ExpectedException expected = ExpectedException.none();
                                                             ^
C:\opt\bamboo-home\xml-data\build-dir\BATCH-BATCHWIN-JOB1\spring-batch-core\src\test\java\org\springframework\batch\core\configuration\annotation\StepScopeConfigurationTests.java:59: warning: [deprecation] none() in ExpectedException has been deprecated
        public ExpectedException expected = ExpectedException.none();
                                                             ^
C:\opt\bamboo-home\xml-data\build-dir\BATCH-BATCHWIN-JOB1\spring-batch-core\src\test\java\org\springframework\batch\core\JobParametersBuilderTests.java:63: warning: [deprecation] none() in ExpectedException has been deprecated
        public ExpectedException expectedException = ExpectedException.none();
                                                                      ^
C:\opt\bamboo-home\xml-data\build-dir\BATCH-BATCHWIN-JOB1\spring-batch-core\src\test\java\org\springframework\batch\core\jsr\configuration\xml\JsrSplitParsingTests.java:44: warning: [deprecation] none() in ExpectedException has been deprecated
        public ExpectedException expectedException = ExpectedException.none();
                                                                      ^
C:\opt\bamboo-home\xml-data\build-dir\BATCH-BATCHWIN-JOB1\spring-batch-core\src\test\java\org\springframework\batch\core\resource\ListPreparedStatementSetterTests.java:55: warning: [deprecation] ListPreparedStatementSetter in org.springframework.batch.item.database.support has been deprecated
        ListPreparedStatementSetter pss;
        ^
C:\opt\bamboo-home\xml-data\build-dir\BATCH-BATCHWIN-JOB1\spring-batch-core\src\test\java\org\springframework\batch\core\resource\ListPreparedStatementSetterTests.java:81: warning: [deprecation] ListPreparedStatementSetter in org.springframework.batch.item.database.support has been deprecated
                pss = new ListPreparedStatementSetter(parameters);
                          ^
C:\opt\bamboo-home\xml-data\build-dir\BATCH-BATCHWIN-JOB1\spring-batch-core\src\test\java\org\springframework\batch\core\resource\ListPreparedStatementSetterTests.java:105: warning: [deprecation] ListPreparedStatementSetter in org.springframework.batch.item.database.support has been deprecated
                pss = new ListPreparedStatementSetter(null);
                          ^
C:\opt\bamboo-home\xml-data\build-dir\BATCH-BATCHWIN-JOB1\spring-batch-core\src\test\java\org\springframework\batch\core\step\item\FaultTolerantStepFactoryBeanRollbackTests.java:137: warning: [deprecation] <T>assertThat(T,Matcher<? super T>) in Assert has been deprecated
                assertThat(e, instanceOf(FatalStepExecutionException.class));
                ^
  where T is a type-variable:
    T extends Object declared in method <T>assertThat(T,Matcher<? super T>)
C:\opt\bamboo-home\xml-data\build-dir\BATCH-BATCHWIN-JOB1\spring-batch-core\src\test\java\org\springframework\batch\core\step\item\FaultTolerantStepFactoryBeanRollbackTests.java:138: warning: [deprecation] <T>assertThat(T,Matcher<? super T>) in Assert has been deprecated
                assertThat(e.getCause(), instanceOf(IllegalArgumentException.class));
                ^
  where T is a type-variable:
    T extends Object declared in method <T>assertThat(T,Matcher<? super T>)
C:\opt\bamboo-home\xml-data\build-dir\BATCH-BATCHWIN-JOB1\spring-batch-core\src\test\java\org\springframework\batch\core\step\item\FaultTolerantStepFactoryBeanRollbackTests.java:150: warning: [deprecation] <T>assertThat(T,Matcher<? super T>) in Assert has been deprecated
                assertThat(e, instanceOf(FatalStepExecutionException.class));
                ^
  where T is a type-variable:
    T extends Object declared in method <T>assertThat(T,Matcher<? super T>)
C:\opt\bamboo-home\xml-data\build-dir\BATCH-BATCHWIN-JOB1\spring-batch-core\src\test\java\org\springframework\batch\core\step\item\FaultTolerantStepFactoryBeanRollbackTests.java:151: warning: [deprecation] <T>assertThat(T,Matcher<? super T>) in Assert has been deprecated
                assertThat(e.getCause(), instanceOf(IllegalArgumentException.class));
                ^
  where T is a type-variable:
    T extends Object declared in method <T>assertThat(T,Matcher<? super T>)
C:\opt\bamboo-home\xml-data\build-dir\BATCH-BATCHWIN-JOB1\spring-batch-core\src\test\java\org\springframework\batch\core\step\item\FaultTolerantStepFactoryBeanTests.java:84: warning: [deprecation] none() in ExpectedException has been deprecated
        public ExpectedException expectedException = ExpectedException.none();
                                                                      ^
C:\opt\bamboo-home\xml-data\build-dir\BATCH-BATCHWIN-JOB1\spring-batch-core\src\test\java\org\springframework\batch\core\step\item\SimpleStepFactoryBeanTests.java:70: warning: [deprecation] none() in ExpectedException has been deprecated
        public ExpectedException expectedException = ExpectedException.none();
                                                                      ^
C:\opt\bamboo-home\xml-data\build-dir\BATCH-BATCHWIN-JOB1\spring-batch-core\src\test\java\org\springframework\batch\core\step\tasklet\ChunkOrientedStepIntegrationTests.java:101: warning: [deprecation] TransactionSynchronizationAdapter in org.springframework.transaction.support has been deprecated
                                .registerSynchronization(new TransactionSynchronizationAdapter() {
                                                             ^
16 warnings

1919 tests completed, 1 failed, 7 skipped

FAILURE: Build failed with an exception.

* What went wrong:
Execution failed for task ':spring-batch-core:test'.
> There were failing tests. See the report at: file:///C:/opt/bamboo-home/xml-data/build-dir/BATCH-BATCHWIN-JOB1/spring-batch-core/build/reports/tests/test/index.html

* Try:
Run with --stacktrace option to get the stack trace. Run with --info or --debug option to get more log output. Run with --scan to get full insights.

* Get more help at https://help.gradle.org

BUILD FAILED in 3m 19s