Build #98

Build plan for MS Windows

Build: #98 failed Manual run by Mahmoud Ben Hassine

Build result summary

Details

Completed
Duration
5 minutes
Labels
None
Agent
bamboo-2k16-00
Revision
ce9a359626a66034a73db73254ef6434a5a236a7 ce9a359626a66034a73db73254ef6434a5a236a7
Total tests
3717
Failing since
#88 (Changes by Mahmoud Ben Hassine)

Responsible

Tests

New test failures 20
Status Test View job Duration
Collapse Failed MapJobExplorerIntegrationTests testRunningJobExecution History
Default Job < 1 sec
java.lang.AssertionError: java.lang.AssertionError: expected:<1> but was:<0>
java.lang.AssertionError: expected:<1> but was:<0>
	at org.junit.Assert.fail(Assert.java:88)
	at org.junit.Assert.failNotEquals(Assert.java:834)
	at org.junit.Assert.assertEquals(Assert.java:645)
	at org.junit.Assert.assertEquals(Assert.java:631)
	at org.springframework.batch.core.explore.support.MapJobExplorerIntegrationTests.testRunningJobExecution(MapJobExplorerIntegrationTests.java:79)
	at sun.reflect.NativeMethodAccessorImpl.invoke0(Native Method)
(44 more lines...)
Collapse Failed StepScopeDestructionCallbackIntegrationTests testDisposableInnerScopedProxy History
Default Job < 1 sec
java.lang.AssertionError: java.lang.AssertionError: expected:<1> but was:<2>
java.lang.AssertionError: expected:<1> but was:<2>
	at org.junit.Assert.fail(Assert.java:88)
	at org.junit.Assert.failNotEquals(Assert.java:834)
	at org.junit.Assert.assertEquals(Assert.java:645)
	at org.junit.Assert.assertEquals(Assert.java:631)
	at org.springframework.batch.core.scope.StepScopeDestructionCallbackIntegrationTests.testDisposableInnerScopedProxy(StepScopeDestructionCallbackIntegrationTests.java:72)
	at sun.reflect.NativeMethodAccessorImpl.invoke0(Native Method)
(54 more lines...)
Collapse Failed StepScopeDestructionCallbackIntegrationTests testRefScopedProxy History
Default Job < 1 sec
java.lang.AssertionError: java.lang.AssertionError: expected:<2> but was:<4>
java.lang.AssertionError: expected:<2> but was:<4>
	at org.junit.Assert.fail(Assert.java:88)
	at org.junit.Assert.failNotEquals(Assert.java:834)
	at org.junit.Assert.assertEquals(Assert.java:645)
	at org.junit.Assert.assertEquals(Assert.java:631)
	at org.springframework.batch.core.scope.StepScopeDestructionCallbackIntegrationTests.testRefScopedProxy(StepScopeDestructionCallbackIntegrationTests.java:90)
	at sun.reflect.NativeMethodAccessorImpl.invoke0(Native Method)
(54 more lines...)
Collapse Failed StepScopeDestructionCallbackIntegrationTests testProxiedScopedProxy History
Default Job < 1 sec
java.lang.AssertionError: java.lang.AssertionError: expected:<1> but was:<2>
java.lang.AssertionError: expected:<1> but was:<2>
	at org.junit.Assert.fail(Assert.java:88)
	at org.junit.Assert.failNotEquals(Assert.java:834)
	at org.junit.Assert.assertEquals(Assert.java:645)
	at org.junit.Assert.assertEquals(Assert.java:631)
	at org.springframework.batch.core.scope.StepScopeDestructionCallbackIntegrationTests.testProxiedScopedProxy(StepScopeDestructionCallbackIntegrationTests.java:81)
	at sun.reflect.NativeMethodAccessorImpl.invoke0(Native Method)
(54 more lines...)
Collapse Failed StepBuilderTests testFunctions History
Default Job < 1 sec
java.lang.AssertionError: java.lang.AssertionError: expected:<COMPLETED> but was:<FAILED>
java.lang.AssertionError: expected:<COMPLETED> but was:<FAILED>
	at org.junit.Assert.fail(Assert.java:88)
	at org.junit.Assert.failNotEquals(Assert.java:834)
	at org.junit.Assert.assertEquals(Assert.java:118)
	at org.junit.Assert.assertEquals(Assert.java:144)
	at org.springframework.batch.core.step.builder.StepBuilderTests.testFunctions(StepBuilderTests.java:241)
	at sun.reflect.NativeMethodAccessorImpl.invoke0(Native Method)
(44 more lines...)
Collapse Failed StepBuilderTests testAnnotationBasedChunkListenerForSimpleTaskletStep History
Default Job < 1 sec
java.lang.AssertionError: java.lang.AssertionError: expected:<COMPLETED> but was:<FAILED>
java.lang.AssertionError: expected:<COMPLETED> but was:<FAILED>
	at org.junit.Assert.fail(Assert.java:88)
	at org.junit.Assert.failNotEquals(Assert.java:834)
	at org.junit.Assert.assertEquals(Assert.java:118)
	at org.junit.Assert.assertEquals(Assert.java:144)
	at org.springframework.batch.core.step.builder.StepBuilderTests.testAnnotationBasedChunkListenerForSimpleTaskletStep(StepBuilderTests.java:129)
	at sun.reflect.NativeMethodAccessorImpl.invoke0(Native Method)
(44 more lines...)
Collapse Failed StepBuilderTests testItemListeners History
Default Job < 1 sec
java.lang.AssertionError: java.lang.AssertionError: expected:<COMPLETED> but was:<FAILED>
java.lang.AssertionError: expected:<COMPLETED> but was:<FAILED>
	at org.junit.Assert.fail(Assert.java:88)
	at org.junit.Assert.failNotEquals(Assert.java:834)
	at org.junit.Assert.assertEquals(Assert.java:118)
	at org.junit.Assert.assertEquals(Assert.java:144)
	at org.springframework.batch.core.step.builder.StepBuilderTests.testItemListeners(StepBuilderTests.java:201)
	at sun.reflect.NativeMethodAccessorImpl.invoke0(Native Method)
(44 more lines...)
Collapse Failed StepBuilderTests testAnnotationBasedChunkListenerForTaskletStep History
Default Job < 1 sec
java.lang.AssertionError: java.lang.AssertionError: expected:<COMPLETED> but was:<FAILED>
java.lang.AssertionError: expected:<COMPLETED> but was:<FAILED>
	at org.junit.Assert.fail(Assert.java:88)
	at org.junit.Assert.failNotEquals(Assert.java:834)
	at org.junit.Assert.assertEquals(Assert.java:118)
	at org.junit.Assert.assertEquals(Assert.java:144)
	at org.springframework.batch.core.step.builder.StepBuilderTests.testAnnotationBasedChunkListenerForTaskletStep(StepBuilderTests.java:110)
	at sun.reflect.NativeMethodAccessorImpl.invoke0(Native Method)
(44 more lines...)
Collapse Failed StepBuilderTests testAnnotationBasedChunkListenerForFaultTolerantTaskletStep History
Default Job < 1 sec
java.lang.AssertionError: java.lang.AssertionError: expected:<COMPLETED> but was:<UNKNOWN>
java.lang.AssertionError: expected:<COMPLETED> but was:<UNKNOWN>
	at org.junit.Assert.fail(Assert.java:88)
	at org.junit.Assert.failNotEquals(Assert.java:834)
	at org.junit.Assert.assertEquals(Assert.java:118)
	at org.junit.Assert.assertEquals(Assert.java:144)
	at org.springframework.batch.core.step.builder.StepBuilderTests.testAnnotationBasedChunkListenerForFaultTolerantTaskletStep(StepBuilderTests.java:149)
	at sun.reflect.NativeMethodAccessorImpl.invoke0(Native Method)
(44 more lines...)
Collapse Failed StepBuilderTests test History
Default Job < 1 sec
java.lang.AssertionError: java.lang.AssertionError: expected:<COMPLETED> but was:<FAILED>
java.lang.AssertionError: expected:<COMPLETED> but was:<FAILED>
	at org.junit.Assert.fail(Assert.java:88)
	at org.junit.Assert.failNotEquals(Assert.java:834)
	at org.junit.Assert.assertEquals(Assert.java:118)
	at org.junit.Assert.assertEquals(Assert.java:144)
	at org.springframework.batch.core.step.builder.StepBuilderTests.test(StepBuilderTests.java:73)
	at sun.reflect.NativeMethodAccessorImpl.invoke0(Native Method)
(44 more lines...)
Collapse Failed StepBuilderTests testListeners History
Default Job < 1 sec
java.lang.AssertionError: java.lang.AssertionError: expected:<COMPLETED> but was:<FAILED>
java.lang.AssertionError: expected:<COMPLETED> but was:<FAILED>
	at org.junit.Assert.fail(Assert.java:88)
	at org.junit.Assert.failNotEquals(Assert.java:834)
	at org.junit.Assert.assertEquals(Assert.java:118)
	at org.junit.Assert.assertEquals(Assert.java:144)
	at org.springframework.batch.core.step.builder.StepBuilderTests.testListeners(StepBuilderTests.java:89)
	at sun.reflect.NativeMethodAccessorImpl.invoke0(Native Method)
(44 more lines...)
Collapse Failed FaultTolerantStepFactoryBeanRetryTests testRetryPolicy History
Default Job < 1 sec
java.lang.AssertionError: java.lang.AssertionError: expected:<1> but was:<0>
java.lang.AssertionError: expected:<1> but was:<0>
	at org.junit.Assert.fail(Assert.java:88)
	at org.junit.Assert.failNotEquals(Assert.java:834)
	at org.junit.Assert.assertEquals(Assert.java:645)
	at org.junit.Assert.assertEquals(Assert.java:631)
	at org.springframework.batch.core.step.item.FaultTolerantStepFactoryBeanRetryTests.testRetryPolicy(FaultTolerantStepFactoryBeanRetryTests.java:706)
	at sun.reflect.NativeMethodAccessorImpl.invoke0(Native Method)
(45 more lines...)
Collapse Failed FaultTolerantStepFactoryBeanRetryTests testProcessAllItemsWhenErrorInWriter History
Default Job < 1 sec
org.junit.ComparisonFailure: org.junit.ComparisonFailure: expected:<[COMPLET]ED> but was:<[FAIL]ED>
org.junit.ComparisonFailure: expected:<[COMPLET]ED> but was:<[FAIL]ED>
	at org.junit.Assert.assertEquals(Assert.java:115)
	at org.junit.Assert.assertEquals(Assert.java:144)
	at org.springframework.batch.core.step.item.FaultTolerantStepFactoryBeanRetryTests.testProcessAllItemsWhenErrorInWriter(FaultTolerantStepFactoryBeanRetryTests.java:230)
	at sun.reflect.NativeMethodAccessorImpl.invoke0(Native Method)
	at sun.reflect.NativeMethodAccessorImpl.invoke(NativeMethodAccessorImpl.java:62)
	at sun.reflect.DelegatingMethodAccessorImpl.invoke(DelegatingMethodAccessorImpl.java:43)
(43 more lines...)
Collapse Failed FaultTolerantStepFactoryBeanRetryTests testNonSkippableException History
Default Job < 1 sec
java.lang.AssertionError: java.lang.AssertionError: expected:<1> but was:<0>
java.lang.AssertionError: expected:<1> but was:<0>
	at org.junit.Assert.fail(Assert.java:88)
	at org.junit.Assert.failNotEquals(Assert.java:834)
	at org.junit.Assert.assertEquals(Assert.java:645)
	at org.junit.Assert.assertEquals(Assert.java:631)
	at org.springframework.batch.core.step.item.FaultTolerantStepFactoryBeanRetryTests.testNonSkippableException(FaultTolerantStepFactoryBeanRetryTests.java:657)
	at sun.reflect.NativeMethodAccessorImpl.invoke0(Native Method)
(45 more lines...)
Collapse Failed FaultTolerantStepFactoryBeanRetryTests testSkipAndRetry History
Default Job < 1 sec
java.lang.AssertionError: java.lang.AssertionError: expected:<2> but was:<0>
java.lang.AssertionError: expected:<2> but was:<0>
	at org.junit.Assert.fail(Assert.java:88)
	at org.junit.Assert.failNotEquals(Assert.java:834)
	at org.junit.Assert.assertEquals(Assert.java:645)
	at org.junit.Assert.assertEquals(Assert.java:631)
	at org.springframework.batch.core.step.item.FaultTolerantStepFactoryBeanRetryTests.testSkipAndRetry(FaultTolerantStepFactoryBeanRetryTests.java:417)
	at sun.reflect.NativeMethodAccessorImpl.invoke0(Native Method)
(45 more lines...)
Collapse Failed FaultTolerantStepFactoryBeanRetryTests testRetryWithNoSkip History
Default Job < 1 sec
java.lang.AssertionError: java.lang.AssertionError: expected:<1> but was:<0>
java.lang.AssertionError: expected:<1> but was:<0>
	at org.junit.Assert.fail(Assert.java:88)
	at org.junit.Assert.failNotEquals(Assert.java:834)
	at org.junit.Assert.assertEquals(Assert.java:645)
	at org.junit.Assert.assertEquals(Assert.java:631)
	at org.springframework.batch.core.step.item.FaultTolerantStepFactoryBeanRetryTests.testRetryWithNoSkip(FaultTolerantStepFactoryBeanRetryTests.java:600)
	at sun.reflect.NativeMethodAccessorImpl.invoke0(Native Method)
(45 more lines...)
Collapse Failed FaultTolerantStepFactoryBeanRetryTests testRestartAfterFailedWrite History
Default Job < 1 sec
java.lang.AssertionError: java.lang.AssertionError: expected:<4> but was:<0>
java.lang.AssertionError: expected:<4> but was:<0>
	at org.junit.Assert.fail(Assert.java:88)
	at org.junit.Assert.failNotEquals(Assert.java:834)
	at org.junit.Assert.assertEquals(Assert.java:645)
	at org.junit.Assert.assertEquals(Assert.java:631)
	at org.springframework.batch.core.step.item.FaultTolerantStepFactoryBeanRetryTests.testRestartAfterFailedWrite(FaultTolerantStepFactoryBeanRetryTests.java:376)
	at sun.reflect.NativeMethodAccessorImpl.invoke0(Native Method)
(45 more lines...)
Collapse Failed FaultTolerantStepFactoryBeanRetryTests testSuccessfulRetryWithReadFailure History
Default Job < 1 sec
java.lang.AssertionError: java.lang.AssertionError: expected:<2> but was:<1>
java.lang.AssertionError: expected:<2> but was:<1>
	at org.junit.Assert.fail(Assert.java:88)
	at org.junit.Assert.failNotEquals(Assert.java:834)
	at org.junit.Assert.assertEquals(Assert.java:645)
	at org.junit.Assert.assertEquals(Assert.java:631)
	at org.springframework.batch.core.step.item.FaultTolerantStepFactoryBeanRetryTests.testSuccessfulRetryWithReadFailure(FaultTolerantStepFactoryBeanRetryTests.java:318)
	at sun.reflect.NativeMethodAccessorImpl.invoke0(Native Method)
(45 more lines...)
Collapse Failed StepExecutorInterruptionTests testInterruptStep History
Default Job < 1 sec
java.lang.AssertionError: java.lang.AssertionError: expected:<STOPPED> but was:<FAILED>
java.lang.AssertionError: expected:<STOPPED> but was:<FAILED>
	at org.junit.Assert.fail(Assert.java:88)
	at org.junit.Assert.failNotEquals(Assert.java:834)
	at org.junit.Assert.assertEquals(Assert.java:118)
	at org.junit.Assert.assertEquals(Assert.java:144)
	at org.springframework.batch.core.step.tasklet.StepExecutorInterruptionTests.testInterruptStep(StepExecutorInterruptionTests.java:125)
	at sun.reflect.NativeMethodAccessorImpl.invoke0(Native Method)
(45 more lines...)
Collapse Failed StepExecutorInterruptionTests testInterruptOnInterruptedException History
Default Job < 1 sec
java.lang.AssertionError: java.lang.AssertionError: expected:<STOPPED> but was:<FAILED>
java.lang.AssertionError: expected:<STOPPED> but was:<FAILED>
	at org.junit.Assert.fail(Assert.java:88)
	at org.junit.Assert.failNotEquals(Assert.java:834)
	at org.junit.Assert.assertEquals(Assert.java:118)
	at org.junit.Assert.assertEquals(Assert.java:144)
	at org.springframework.batch.core.step.tasklet.StepExecutorInterruptionTests.testInterruptOnInterruptedException(StepExecutorInterruptionTests.java:175)
	at sun.reflect.NativeMethodAccessorImpl.invoke0(Native Method)
(45 more lines...)
Existing test failures 1
Status Test Failing since View job Duration
org.junit.ComparisonFailure: org.junit.ComparisonFailure: expected:<[STOPPED]> but was:<[NOOP]>
org.junit.ComparisonFailure: expected:<[STOPPED]> but was:<[NOOP]>
	at org.junit.Assert.assertEquals(Assert.java:115)
	at org.junit.Assert.assertEquals(Assert.java:144)
	at org.springframework.batch.core.configuration.xml.SplitInterruptedJobParserTests.testSplitInterrupted(SplitInterruptedJobParserTests.java:59)
	at sun.reflect.NativeMethodAccessorImpl.invoke0(Native Method)
	at sun.reflect.NativeMethodAccessorImpl.invoke(NativeMethodAccessorImpl.java:62)
	at sun.reflect.DelegatingMethodAccessorImpl.invoke(DelegatingMethodAccessorImpl.java:43)
(51 more lines...)