Build #21

Build plan for MS Windows

Build result summary

Details

Completed
Duration
102 minutes
Labels
None
Agent
bamboo-2k16-02
Revision
78fa263f6b005bcf85ef486e6b9b68a932abeced 78fa263f6b005bcf85ef486e6b9b68a932abeced
Total tests
3528
Fixed in
#29 (Changes by Michael Minella)

Tests

Responsible

Code commits

Author Commit Message Commit date
Mahmoud Ben Hassine Mahmoud Ben Hassine 78fa263f6b005bcf85ef486e6b9b68a932abeced 78fa263f6b005bcf85ef486e6b9b68a932abeced Polish 62a2e65e204287196719451d1965c4fa0e2cce4a
Add null check for delimiter
Drummond Dawson <drumonii@users.noreply.github.com> Drummond Dawson <drumonii@users.noreply.github.com> 3f17b90438dcba87c362de014e6672d889f2fc69 3f17b90438dcba87c362de014e6672d889f2fc69 Support empty delimiter in DelimitedBuilder of FlatFileItemWriterBuilder
Previously, if supplying an empty delimiter, to the delimited().delimiter() of DelimitedBuilder from the parent FlatFileItemWriterBuilder, it would be ignored and instead use the default delimiter ",".

Resolves BATCH-2844

Tests

New test failures 1
Status Test View job Duration
Collapse Failed JsrSplitParsingTests test History
Default Job < 1 sec
java.lang.AssertionError: java.lang.AssertionError: expected:<COMPLETED> but was:<FAILED>
java.lang.AssertionError: expected:<COMPLETED> but was:<FAILED>
	at org.junit.Assert.fail(Assert.java:88)
	at org.junit.Assert.failNotEquals(Assert.java:834)
	at org.junit.Assert.assertEquals(Assert.java:118)
	at org.junit.Assert.assertEquals(Assert.java:144)
	at org.springframework.batch.core.jsr.configuration.xml.JsrSplitParsingTests.test(JsrSplitParsingTests.java:49)
	at sun.reflect.NativeMethodAccessorImpl.invoke0(Native Method)
(46 more lines...)

Jira issues

IssueDescriptionStatus
Unknown Issue TypeBATCH-2844Could not obtain issue details from Jira