Build #336

Plan to test the build on a specific branch

Build: #336 failed Scheduled

Build result summary

Details

Completed
Duration
2 minutes
Labels
None
Agent
bamboo-24.af.pivotal.io
Revision
32b2b5683c1f253f5b55d19606f5259021b6f5d3 32b2b5683c1f253f5b55d19606f5259021b6f5d3
Total tests
1913
Failing since
#335 (Scheduled – )
Fixed in
#338 (Scheduled)

Responsible

This build has been failing since #335
No one has taken responsibility

Tests

New test failures 1
Status Test View job Duration
Collapse Failed JsrSplitParsingTests test History
Default Job < 1 sec
java.lang.AssertionError: java.lang.AssertionError: expected:<COMPLETED> but was:<FAILED>
java.lang.AssertionError: expected:<COMPLETED> but was:<FAILED>
	at org.junit.Assert.fail(Assert.java:88)
	at org.junit.Assert.failNotEquals(Assert.java:834)
	at org.junit.Assert.assertEquals(Assert.java:118)
	at org.junit.Assert.assertEquals(Assert.java:144)
	at org.springframework.batch.core.jsr.configuration.xml.JsrSplitParsingTests.test(JsrSplitParsingTests.java:49)
	at sun.reflect.NativeMethodAccessorImpl.invoke0(Native Method)
(46 more lines...)
Fixed tests 1
Status Test Failing since View job Duration
Successful DecisionStepTests testDecisionAfterSplit History
Failing since build #335 (Scheduled) Default Job < 1 sec