Build #337

Plan to test the build on a specific branch

Build: #337 failed Scheduled

Build result summary

Details

Completed
Duration
2 minutes
Labels
None
Agent
bamboo-22.af.pivotal.io
Revision
32b2b5683c1f253f5b55d19606f5259021b6f5d3 32b2b5683c1f253f5b55d19606f5259021b6f5d3
Total tests
1913
Failing since
#335 (Scheduled – )
Fixed in
#338 (Scheduled)

Responsible

This build has been failing since #335
No one has taken responsibility

Tests

New test failures 1
Status Test View job Duration
Collapse Failed OptimisticLockingFailureTests testAsyncStopOfStartingJob History
Default Job 2 secs
org.springframework.batch.core.repository.JobExecutionAlreadyRunningException: org.springframework.batch.core.repository.JobExecutionAlreadyRunningException: A job execution for this job is already running: JobInstance: id=0, version=0, Job=[locking]
org.springframework.batch.core.repository.JobExecutionAlreadyRunningException: A job execution for this job is already running: JobInstance: id=0, version=0, Job=[locking]
	at org.springframework.batch.core.repository.support.SimpleJobRepository.createJobExecution(SimpleJobRepository.java:121)
	at sun.reflect.GeneratedMethodAccessor113.invoke(Unknown Source)
	at sun.reflect.DelegatingMethodAccessorImpl.invoke(DelegatingMethodAccessorImpl.java:43)
	at java.lang.reflect.Method.invoke(Method.java:498)
	at org.springframework.aop.support.AopUtils.invokeJoinpointUsingReflection(AopUtils.java:344)
	at org.springframework.aop.framework.ReflectiveMethodInvocation.invokeJoinpoint(ReflectiveMethodInvocation.java:198)
(55 more lines...)
Fixed tests 1
Status Test Failing since View job Duration
Successful JsrSplitParsingTests test History
Failing since build #336 (Scheduled) Default Job < 1 sec