Build #345

Plan to test the build on a specific branch

Build: #345 failed Scheduled

Build result summary

Details

Completed
Duration
2 minutes
Labels
None
Agent
bamboo-20.af.pivotal.io
Revision
32b2b5683c1f253f5b55d19606f5259021b6f5d3 32b2b5683c1f253f5b55d19606f5259021b6f5d3
Total tests
1913
Failing since
#344 (Scheduled – )
Fixed in
#346 (Scheduled with changes by Mahmoud Ben Hassine)

Responsible

This build has been failing since #344
No one has taken responsibility

Tests

New test failures 1
Status Test View job Duration
Collapse Failed DecisionStepTests testDecisionAfterSplit History
Default Job < 1 sec
java.lang.AssertionError: java.lang.AssertionError: Received a FAILED because of  expected:<COMPLETED> but was:<FAILED>
java.lang.AssertionError: Received a FAILED because of  expected:<COMPLETED> but was:<FAILED>
	at org.junit.Assert.fail(Assert.java:88)
	at org.junit.Assert.failNotEquals(Assert.java:834)
	at org.junit.Assert.assertEquals(Assert.java:118)
	at org.springframework.batch.core.jsr.step.DecisionStepTests.testDecisionAfterSplit(DecisionStepTests.java:113)
	at sun.reflect.NativeMethodAccessorImpl.invoke0(Native Method)
	at sun.reflect.NativeMethodAccessorImpl.invoke(NativeMethodAccessorImpl.java:62)
(44 more lines...)
Fixed tests 1
Status Test Failing since View job Duration
Successful JsrSplitParsingTests test History
Failing since build #344 (Scheduled) Default Job < 1 sec