Build #347

Plan to test the build on a specific branch

Build: #347 failed Scheduled with changes by Mahmoud Ben Hassine

Build result summary

Details

Completed
Duration
3 minutes
Labels
None
Agent
bamboo-17.af.pivotal.io
Revision
fef02a6e306b919ef98c8e55465075ec2c004f42 fef02a6e306b919ef98c8e55465075ec2c004f42
Total tests
1913
Fixed in
#348 (Scheduled)

Tests

Responsible

Code commits

Author Commit Message Commit date
Mahmoud Ben Hassine Mahmoud Ben Hassine fef02a6e306b919ef98c8e55465075ec2c004f42 fef02a6e306b919ef98c8e55465075ec2c004f42 Upgrade gradle to v6.0.1
Mahmoud Ben Hassine Mahmoud Ben Hassine f19f32fd79a340b798ab84f21216b4668f79e15a f19f32fd79a340b798ab84f21216b4668f79e15a Remove unused generateSql gradle task and its corresponding resources

Tests

New test failures 1
Status Test View job Duration
Collapse Failed DecisionStepTests testDecisionAfterSplit History
Default Job < 1 sec
java.lang.AssertionError: java.lang.AssertionError: Received a FAILED because of  expected:<COMPLETED> but was:<FAILED>
java.lang.AssertionError: Received a FAILED because of  expected:<COMPLETED> but was:<FAILED>
	at org.junit.Assert.fail(Assert.java:88)
	at org.junit.Assert.failNotEquals(Assert.java:834)
	at org.junit.Assert.assertEquals(Assert.java:118)
	at org.springframework.batch.core.jsr.step.DecisionStepTests.testDecisionAfterSplit(DecisionStepTests.java:113)
	at sun.reflect.NativeMethodAccessorImpl.invoke0(Native Method)
	at sun.reflect.NativeMethodAccessorImpl.invoke(NativeMethodAccessorImpl.java:62)
(44 more lines...)