Build #357

Plan to test the build on a specific branch

Build result summary

Details

Completed
Duration
12 minutes
Labels
None
Agent
bamboo-17.af.pivotal.io
Revision
bcc4665faa313af6200cca387c3a848217e7f058 bcc4665faa313af6200cca387c3a848217e7f058
Total tests
1913
Fixed in
#359 (Scheduled)

Tests

Responsible

No one has taken responsibility for this failure

Code commits

Author Commit Message Commit date
Wannes <wa_voe@hotmail.com> Wannes <wa_voe@hotmail.com> bcc4665faa313af6200cca387c3a848217e7f058 bcc4665faa313af6200cca387c3a848217e7f058 Update step.adoc
typo in a variable
Pascal Schumacher <pascalschumacher@gmx.net> Pascal Schumacher <pascalschumacher@gmx.net> 2916da30ddc25b5eda05b6d362f90d4847c54ef9 2916da30ddc25b5eda05b6d362f90d4847c54ef9 Improve formatting of IllegalArgumentException message thrown by DefaultExecutionContextSerializer

Tests

New test failures 1
Status Test View job Duration
Collapse Failed DecisionStepTests testDecisionAfterSplit History
Default Job < 1 sec
java.lang.AssertionError: java.lang.AssertionError: Received a FAILED because of  expected:<COMPLETED> but was:<FAILED>
java.lang.AssertionError: Received a FAILED because of  expected:<COMPLETED> but was:<FAILED>
	at org.junit.Assert.fail(Assert.java:88)
	at org.junit.Assert.failNotEquals(Assert.java:834)
	at org.junit.Assert.assertEquals(Assert.java:118)
	at org.springframework.batch.core.jsr.step.DecisionStepTests.testDecisionAfterSplit(DecisionStepTests.java:113)
	at sun.reflect.NativeMethodAccessorImpl.invoke0(Native Method)
	at sun.reflect.NativeMethodAccessorImpl.invoke(NativeMethodAccessorImpl.java:62)
(44 more lines...)