Build #358

Plan to test the build on a specific branch

Build: #358 failed Scheduled

Build result summary

Details

Completed
Duration
2 minutes
Labels
None
Agent
bamboo-22.af.pivotal.io
Revision
bcc4665faa313af6200cca387c3a848217e7f058 bcc4665faa313af6200cca387c3a848217e7f058
Total tests
1913
Failing since
#357 (Scheduled with changes by Wannes <wa_voe@hotmail.com> and Pascal Schumacher <pascalschumacher@gmx.net>)
Fixed in
#359 (Scheduled)

Responsible

This build has been failing since #357
No one has taken responsibility

Tests

New test failures 1
Status Test View job Duration
Collapse Failed FaultTolerantStepFactoryBeanRollbackTests testMultithreadedSkipInWriter History
Default Job < 1 sec
java.lang.AssertionError: java.lang.AssertionError: expected:<5> but was:<6>
java.lang.AssertionError: expected:<5> but was:<6>
	at org.junit.Assert.fail(Assert.java:88)
	at org.junit.Assert.failNotEquals(Assert.java:834)
	at org.junit.Assert.assertEquals(Assert.java:645)
	at org.junit.Assert.assertEquals(Assert.java:631)
	at org.springframework.batch.core.step.item.FaultTolerantStepFactoryBeanRollbackTests.testMultithreadedSkipInWriter(FaultTolerantStepFactoryBeanRollbackTests.java:555)
	at sun.reflect.NativeMethodAccessorImpl.invoke0(Native Method)
(46 more lines...)
Fixed tests 1
Status Test Failing since View job Duration
Successful DecisionStepTests testDecisionAfterSplit History
Failing since build #357 (Scheduled with changes by Wannes <wa_voe@hotmail.com> and Pascal Schumacher <pascalschumacher@gmx.net>) Default Job < 1 sec