Build #361

Plan to test the build on a specific branch

Build: #361 failed Scheduled

Build result summary

Details

Completed
Duration
2 minutes
Labels
None
Agent
bamboo-18.af.pivotal.io
Revision
7ba73d8dfe976cf7c25cbc1833f2701c7ae231a1 7ba73d8dfe976cf7c25cbc1833f2701c7ae231a1
Total tests
1913
Fixed in
#362 (Scheduled)

Tests

Responsible

No one has taken responsibility for this failure

Tests

New test failures 1
Status Test View job Duration
Collapse Failed OptimisticLockingFailureTests testAsyncStopOfStartingJob History
Default Job 2 secs
org.springframework.batch.core.repository.JobExecutionAlreadyRunningException: org.springframework.batch.core.repository.JobExecutionAlreadyRunningException: A job execution for this job is already running: JobInstance: id=0, version=0, Job=[locking]
org.springframework.batch.core.repository.JobExecutionAlreadyRunningException: A job execution for this job is already running: JobInstance: id=0, version=0, Job=[locking]
	at org.springframework.batch.core.repository.support.SimpleJobRepository.createJobExecution(SimpleJobRepository.java:121)
	at sun.reflect.GeneratedMethodAccessor114.invoke(Unknown Source)
	at sun.reflect.DelegatingMethodAccessorImpl.invoke(DelegatingMethodAccessorImpl.java:43)
	at java.lang.reflect.Method.invoke(Method.java:498)
	at org.springframework.aop.support.AopUtils.invokeJoinpointUsingReflection(AopUtils.java:344)
	at org.springframework.aop.framework.ReflectiveMethodInvocation.invokeJoinpoint(ReflectiveMethodInvocation.java:198)
(55 more lines...)