Build #375

Plan to test the build on a specific branch

Build: #375 failed Scheduled

Build result summary

Details

Completed
Duration
2 minutes
Labels
None
Agent
bamboo-16.af.pivotal.io
Revision
7ba73d8dfe976cf7c25cbc1833f2701c7ae231a1 7ba73d8dfe976cf7c25cbc1833f2701c7ae231a1
Total tests
1913
Fixed in
#376 (Scheduled)

Tests

Responsible

No one has taken responsibility for this failure

Tests

New test failures 1
Status Test View job Duration
Collapse Failed JsrSplitParsingTests test History
Default Job < 1 sec
java.lang.AssertionError: java.lang.AssertionError: expected:<COMPLETED> but was:<FAILED>
java.lang.AssertionError: expected:<COMPLETED> but was:<FAILED>
	at org.junit.Assert.fail(Assert.java:88)
	at org.junit.Assert.failNotEquals(Assert.java:834)
	at org.junit.Assert.assertEquals(Assert.java:118)
	at org.junit.Assert.assertEquals(Assert.java:144)
	at org.springframework.batch.core.jsr.configuration.xml.JsrSplitParsingTests.test(JsrSplitParsingTests.java:49)
	at sun.reflect.NativeMethodAccessorImpl.invoke0(Native Method)
(46 more lines...)