Build #387

Plan to test the build on a specific branch

Build: #387 failed Scheduled

Build result summary

Details

Completed
Duration
2 minutes
Labels
None
Agent
bamboo-14.af.pivotal.io
Revision
8e8f9c8101b52b64050d8e92363de2d28319e3b0 8e8f9c8101b52b64050d8e92363de2d28319e3b0
Total tests
1914
Fixed in
#388 (Scheduled)

Tests

Responsible

No one has taken responsibility for this failure

Tests

New test failures 1
Status Test View job Duration
Collapse Failed DecisionStepTests testDecisionAfterSplit History
Default Job < 1 sec
java.lang.AssertionError: java.lang.AssertionError: Received a FAILED because of org.springframework.batch.core.JobExecutionException: Flow execution ended unexpectedly
	at org.springframework.batch.core.jsr.job.flow.JsrFlowJob.doExecute(JsrFlowJob.java:88)
	at org.springframework.batch.core.job.AbstractJob.execute(AbstractJob.java:319)
	at org.springframework.batch.core.jsr.launch.JsrJobOperator$2.run(JsrJobOperator.java:674)
	at java.lang.Thread.run(Thread.java:748)
Caused by: org.springframework.batch.core.job.flow.FlowExecutionException: Ended flow=flow2.step1 at state=flow2.step1.flow2.step1 with exception
	at org.springframework.batch.core.job.flow.support.SimpleFlow.resume(SimpleFlow.java:178)
	at org.springframework.batch.core.job.flow.support.SimpleFlow.start(SimpleFlow.java:144)
(95 more lines...)