Build #392

Plan to test the build on a specific branch

Build: #392 failed Scheduled

Build result summary

Details

Completed
Duration
2 minutes
Labels
None
Agent
bamboo-16.af.pivotal.io
Revision
8e8f9c8101b52b64050d8e92363de2d28319e3b0 8e8f9c8101b52b64050d8e92363de2d28319e3b0
Total tests
1914
Fixed in
#393 (Scheduled)

Tests

Responsible

No one has taken responsibility for this failure

Tests

New test failures 1
Status Test View job Duration
Collapse Failed JsrSplitParsingTests test History
Default Job < 1 sec
java.lang.AssertionError: java.lang.AssertionError: expected:<COMPLETED> but was:<FAILED>
java.lang.AssertionError: expected:<COMPLETED> but was:<FAILED>
	at org.junit.Assert.fail(Assert.java:89)
	at org.junit.Assert.failNotEquals(Assert.java:835)
	at org.junit.Assert.assertEquals(Assert.java:120)
	at org.junit.Assert.assertEquals(Assert.java:146)
	at org.springframework.batch.core.jsr.configuration.xml.JsrSplitParsingTests.test(JsrSplitParsingTests.java:49)
	at sun.reflect.NativeMethodAccessorImpl.invoke0(Native Method)
(48 more lines...)