Build #392

Plan to test the build on a specific branch

Build: #392 failed Scheduled

Test results

  • 1,914 tests in total
  • 1 test failed
  • 1 failure is new
  • 7 tests were quarantined / skipped
  • 45 seconds taken in total.
New test failures 1
Status Test View job Duration
Collapse Failed JsrSplitParsingTests test History
Default Job < 1 sec
java.lang.AssertionError: java.lang.AssertionError: expected:<COMPLETED> but was:<FAILED>
java.lang.AssertionError: expected:<COMPLETED> but was:<FAILED>
	at org.junit.Assert.failNotEquals(
	at org.junit.Assert.assertEquals(
	at org.junit.Assert.assertEquals(
	at org.springframework.batch.core.jsr.configuration.xml.JsrSplitParsingTests.test(
	at sun.reflect.NativeMethodAccessorImpl.invoke0(Native Method)
(48 more lines...)
Skipped tests 7
Status Test Failing since View job
Skipped ItemListenerErrorTests testOnReadError History
Default Job
Skipped JobRepositoryFactoryBeanTests testTransactionAttributesForCreateMethodNullHypothesis History
Default Job
Skipped StepScopeClassIntegrationTests testNested History
Default Job
Skipped StepScopeClassIntegrationTests testSimpleValue History
Default Job
Skipped FaultTolerantStepFactoryBeanUnexpectedRollbackTests testTransactionException History
Default Job
Skipped AsyncChunkOrientedStepIntegrationTests testStatus History
Default Job
Skipped ChunkOrientedStepIntegrationTests testStatusForCommitFailedException History
Default Job