Build #404

Plan to test the build on a specific branch

Build: #404 failed Scheduled with changes by BenjaminHetzJelli <benjamin@jelli.com>

Build result summary

Details

Completed
Duration
2 minutes
Labels
None
Agent
bamboo-14.af.pivotal.io
Revision
7f01bf78cfce89e446f57d7f0410ccb14be4646b 7f01bf78cfce89e446f57d7f0410ccb14be4646b
Total tests
1914
Fixed in
#406 (Scheduled)

Tests

Responsible

No one has taken responsibility for this failure

Code commits

Author Commit Message Commit date
BenjaminHetzJelli <benjamin@jelli.com> BenjaminHetzJelli <benjamin@jelli.com> 7f01bf78cfce89e446f57d7f0410ccb14be4646b 7f01bf78cfce89e446f57d7f0410ccb14be4646b Trim Keywords Followed By Whitespace Other Than The Character ' '
Modify `removeKeyWord(...)` such that the keyword is removed regardless
of what kind of whitespace follows. This is especially useful for those
who read in SQL from a file which has been formatted such that keywords
live on their own lines.

Added unit tests for trimming whitespace.

Resolves #765

Tests

New test failures 1
Status Test View job Duration
Collapse Failed JsrSplitParsingTests test History
Default Job < 1 sec
java.lang.AssertionError: java.lang.AssertionError: expected:<COMPLETED> but was:<FAILED>
java.lang.AssertionError: expected:<COMPLETED> but was:<FAILED>
	at org.junit.Assert.fail(Assert.java:89)
	at org.junit.Assert.failNotEquals(Assert.java:835)
	at org.junit.Assert.assertEquals(Assert.java:120)
	at org.junit.Assert.assertEquals(Assert.java:146)
	at org.springframework.batch.core.jsr.configuration.xml.JsrSplitParsingTests.test(JsrSplitParsingTests.java:49)
	at sun.reflect.NativeMethodAccessorImpl.invoke0(Native Method)
(48 more lines...)