Build #410

Plan to test the build on a specific branch

Build: #410 failed Scheduled

Build result summary

Details

Completed
Duration
2 minutes
Labels
None
Agent
bamboo-14.af.pivotal.io
Revision
ad3dcbc96afcef6e6d7dce75c5c208e540adf789 ad3dcbc96afcef6e6d7dce75c5c208e540adf789
Total tests
1914
Fixed in
#411 (Scheduled)

Tests

Responsible

No one has taken responsibility for this failure

Tests

New test failures 1
Status Test View job Duration
Collapse Failed FaultTolerantStepFactoryBeanRollbackTests testMultithreadedSkipInWriter History
Default Job < 1 sec
java.lang.AssertionError: java.lang.AssertionError: expected:<5> but was:<6>
java.lang.AssertionError: expected:<5> but was:<6>
	at org.junit.Assert.fail(Assert.java:89)
	at org.junit.Assert.failNotEquals(Assert.java:835)
	at org.junit.Assert.assertEquals(Assert.java:647)
	at org.junit.Assert.assertEquals(Assert.java:633)
	at org.springframework.batch.core.step.item.FaultTolerantStepFactoryBeanRollbackTests.testMultithreadedSkipInWriter(FaultTolerantStepFactoryBeanRollbackTests.java:555)
	at sun.reflect.NativeMethodAccessorImpl.invoke0(Native Method)
(49 more lines...)