Build #481

Gradle build for Spring Batch

Build result summary

Details

Completed
Duration
7 minutes
Labels
None
Agent
bamboo-07.af.pivotal.io
Revision
3902837c3c23379d508bd21312a4acd2ebcd1a46 3902837c3c23379d508bd21312a4acd2ebcd1a46
Total tests
1899
Fixed in
#495 (Changes by Mahmoud Ben Hassine)

Responsible

No one has taken responsibility for this failure

Code commits

Author Commit Message Commit date
Drummond Dawson <drumonii@users.noreply.github.com> Drummond Dawson <drumonii@users.noreply.github.com> 3902837c3c23379d508bd21312a4acd2ebcd1a46 3902837c3c23379d508bd21312a4acd2ebcd1a46 Replace explicit type with diamond operator in docs module
Drummond Dawson <drumonii@users.noreply.github.com> Drummond Dawson <drumonii@users.noreply.github.com> 5ebf09e3563841d165a225c618e15daa7ddd8849 5ebf09e3563841d165a225c618e15daa7ddd8849 Replace explicit type with diamond operator in core tests module

Tests

New test failures 1
Status Test View job Duration
Collapse Failed AsyncTaskletStepTests testStepExecutionUpdates History
Default Job < 1 sec
java.lang.AssertionError: java.lang.AssertionError: expected:<COMPLETED> but was:<FAILED>
java.lang.AssertionError: expected:<COMPLETED> but was:<FAILED>
	at org.junit.Assert.fail(Assert.java:88)
	at org.junit.Assert.failNotEquals(Assert.java:834)
	at org.junit.Assert.assertEquals(Assert.java:118)
	at org.junit.Assert.assertEquals(Assert.java:144)
	at org.springframework.batch.core.step.tasklet.AsyncTaskletStepTests.testStepExecutionUpdates(AsyncTaskletStepTests.java:129)
	at sun.reflect.NativeMethodAccessorImpl.invoke0(Native Method)
(44 more lines...)