Build #491

Gradle build for Spring Batch

Build: #491 failed Changes by Mahmoud Ben Hassine

Build result summary

Details

Completed
Duration
7 minutes
Labels
None
Agent
bamboo-08.af.pivotal.io
Revision
2a578ae6639bd3b2087549aef14194fc1e1a6ec3 2a578ae6639bd3b2087549aef14194fc1e1a6ec3
Total tests
3658
Failing since
#481 (Changes by Drummond Dawson <drumonii@users.noreply.github.com>)
Fixed in
#495 (Changes by Mahmoud Ben Hassine)

Responsible

This build has been failing since #481
No one has taken responsibility

Code commits

Author Commit Message Commit date
Mahmoud Ben Hassine Mahmoud Ben Hassine 2a578ae6639bd3b2087549aef14194fc1e1a6ec3 2a578ae6639bd3b2087549aef14194fc1e1a6ec3 Remove unused imports
Mahmoud Ben Hassine Mahmoud Ben Hassine a5748136d23df4976848ff51c41bcf68a6300488 a5748136d23df4976848ff51c41bcf68a6300488 Fix typos

Tests

New test failures 1
Status Test View job Duration
Collapse Failed JobOperatorFunctionalTests testMultipleSimultaneousInstances History
Default Job < 1 sec
java.lang.AssertionError: java.lang.AssertionError
java.lang.AssertionError
	at org.junit.Assert.fail(Assert.java:86)
	at org.junit.Assert.assertTrue(Assert.java:41)
	at org.junit.Assert.assertTrue(Assert.java:52)
	at org.springframework.batch.sample.JobOperatorFunctionalTests.testMultipleSimultaneousInstances(JobOperatorFunctionalTests.java:135)
	at sun.reflect.NativeMethodAccessorImpl.invoke0(Native Method)
	at sun.reflect.NativeMethodAccessorImpl.invoke(NativeMethodAccessorImpl.java:62)
(52 more lines...)
Fixed tests 1
Status Test Failing since View job Duration
Successful JsrSplitParsingTests test History
Failing since build #490 (Changes by Drummond Dawson <drumonii@users.noreply.github.com>) Default Job < 1 sec