Build #493

Gradle build for Spring Batch

Build: #493 failed Changes by Mahmoud Ben Hassine

Build result summary

Details

Completed
Duration
6 minutes
Labels
None
Agent
bamboo-09.af.pivotal.io
Revision
edfbdbb82a61294c2ea7eaabeb1add29ca6cb068 edfbdbb82a61294c2ea7eaabeb1add29ca6cb068
Total tests
3661
Failing since
#481 (Changes by Drummond Dawson <drumonii@users.noreply.github.com>)
Fixed in
#495 (Changes by Mahmoud Ben Hassine)

Responsible

This build has been failing since #481
No one has taken responsibility

Code commits

Author Commit Message Commit date
Mahmoud Ben Hassine Mahmoud Ben Hassine edfbdbb82a61294c2ea7eaabeb1add29ca6cb068 edfbdbb82a61294c2ea7eaabeb1add29ca6cb068 Tweak XmlInputFactory settings

Configuration changes

Plan configuration has changed since the last successful build. See the plan audit log for more details.

Tests

Existing test failures 1
Status Test Failing since View job Duration
java.lang.AssertionError: java.lang.AssertionError
java.lang.AssertionError
	at org.junit.Assert.fail(Assert.java:86)
	at org.junit.Assert.assertTrue(Assert.java:41)
	at org.junit.Assert.assertTrue(Assert.java:52)
	at org.springframework.batch.sample.JobOperatorFunctionalTests.testMultipleSimultaneousInstances(JobOperatorFunctionalTests.java:135)
	at sun.reflect.NativeMethodAccessorImpl.invoke0(Native Method)
	at sun.reflect.NativeMethodAccessorImpl.invoke(NativeMethodAccessorImpl.java:62)
(52 more lines...)