Build #493

Gradle build for Spring Batch

Build: #493 failed Changes by Mahmoud Ben Hassine

Logs

The following logs have been generated by the jobs in this plan.
  • Expand all
  • Collapse all
Job Logs
Collapse Default Job Default Stage Download or View
14-Jan-2019 14:04:42
14-Jan-2019 14:04:42 org.springframework.batch.sample.JobOperatorFunctionalTests > testMultipleSimultaneousInstances FAILED
14-Jan-2019 14:04:42     java.lang.AssertionError at JobOperatorFunctionalTests.java:135
14-Jan-2019 14:05:21
14-Jan-2019 14:05:21 128 tests completed, 1 failed
14-Jan-2019 14:05:21
14-Jan-2019 14:05:21 FAILURE: Build failed with an exception.
14-Jan-2019 14:05:21
14-Jan-2019 14:05:21 * What went wrong:
14-Jan-2019 14:05:21 Execution failed for task ':spring-batch-samples:test'.
14-Jan-2019 14:05:21 > There were failing tests. See the report at: file:///opt/bamboo-home/xml-data/build-dir/BATCH-GRAD-JOB1/spring-batch-samples/build/reports/tests/test/index.html
14-Jan-2019 14:05:21
14-Jan-2019 14:05:21 * Try:
14-Jan-2019 14:05:21 Run with --stacktrace option to get the stack trace. Run with --info or --debug option to get more log output. Run with --scan to get full insights.
14-Jan-2019 14:05:21
14-Jan-2019 14:05:21 * Get more help at https://help.gradle.org
14-Jan-2019 14:05:21
14-Jan-2019 14:05:21 BUILD FAILED in 6m 11s
14-Jan-2019 14:05:21
14-Jan-2019 14:05:21 > Task :spring-batch-samples:test FAILED
14-Jan-2019 14:05:21
14-Jan-2019 14:05:21 Deprecated Gradle features were used in this build, making it incompatible with Gradle 5.0.
14-Jan-2019 14:05:21 Use '--warning-mode all' to show the individual deprecation warnings.
14-Jan-2019 14:05:21 See https://docs.gradle.org/4.10/userguide/command_line_interface.html#sec:command_line_warnings
14-Jan-2019 14:05:21 74 actionable tasks: 65 executed, 9 up-to-date