Build #493

Gradle build for Spring Batch

Build: #493 failed Changes by Mahmoud Ben Hassine

Test results

  • 3,661 tests in total
  • 1 test failed
  • 10 tests were quarantined / skipped
  • 2 minutes taken in total.
Existing test failures 1
Status Test Failing since View job Duration
java.lang.AssertionError: java.lang.AssertionError
java.lang.AssertionError
	at org.junit.Assert.fail(Assert.java:86)
	at org.junit.Assert.assertTrue(Assert.java:41)
	at org.junit.Assert.assertTrue(Assert.java:52)
	at org.springframework.batch.sample.JobOperatorFunctionalTests.testMultipleSimultaneousInstances(JobOperatorFunctionalTests.java:135)
	at sun.reflect.NativeMethodAccessorImpl.invoke0(Native Method)
	at sun.reflect.NativeMethodAccessorImpl.invoke(NativeMethodAccessorImpl.java:62)
(52 more lines...)
Skipped tests 10
Status Test Failing since View job
Skipped ItemListenerErrorTests testOnReadError History
Default Job
Skipped JobRepositoryFactoryBeanTests testTransactionAttributesForCreateMethodNullHypothesis History
Default Job
Skipped StepScopeClassIntegrationTests testNested History
Default Job
Skipped StepScopeClassIntegrationTests testSimpleValue History
Default Job
Skipped FaultTolerantStepFactoryBeanUnexpectedRollbackTests testTransactionException History
Default Job
Skipped AsyncChunkOrientedStepIntegrationTests testStatus History
Default Job
Skipped ChunkOrientedStepIntegrationTests testStatusForCommitFailedException History
Default Job
Skipped AsyncItemProcessorMessagingGatewayTests testMultiExecution History
Default Job
Skipped ResourceSplitterIntegrationTests testVanillaConversion History
Default Job
Skipped ConcurrentTransactionAwareProxyTests testConcurrentTransactionalList History
Default Job