Build #556

Gradle build for Spring Batch

Build result summary

Details

Completed
Duration
3 minutes
Labels
None
Agent
bamboo-23.af.pivotal.io
Revision
f26165e764c1e4b25a3778eafa9783bea7d73693 f26165e764c1e4b25a3778eafa9783bea7d73693
Total tests
3781
Fixed in
#559 (Changes by Michael Minella and Jay Bryant)

Tests

Responsible

Code commits

Author Commit Message Commit date
Mahmoud Ben Hassine Mahmoud Ben Hassine f26165e764c1e4b25a3778eafa9783bea7d73693 f26165e764c1e4b25a3778eafa9783bea7d73693 Polish bd53168ddb613aa5a5f8bc550f20a828ce3cf17d
David Turanski <dturanski@pivotal.io> David Turanski <dturanski@pivotal.io> bd53168ddb613aa5a5f8bc550f20a828ce3cf17d bd53168ddb613aa5a5f8bc550f20a828ce3cf17d Implement AvroItemReader and AvroItemWriter
Resolves BATCH-2833

Tests

New test failures 1
Status Test View job Duration
Collapse Failed KafkaItemReaderTests testReadFromMultiplePartitionsAfterRestart History
Default Job 3 secs
java.lang.AssertionError: java.lang.AssertionError: 
Expected: iterable over ["val4", "val6", "val7"] in any order
     but: Not matched: null
java.lang.AssertionError: 
Expected: iterable over ["val4", "val6", "val7"] in any order
     but: Not matched: null
	at org.hamcrest.MatcherAssert.assertThat(MatcherAssert.java:20)
	at org.junit.Assert.assertThat(Assert.java:956)
(51 more lines...)

Jira issues

IssueDescriptionStatus
Unknown Issue TypeBATCH-2833Could not obtain issue details from Jira