Build #602

Gradle build for Spring Batch

Build: #602 failed Manual run by Mahmoud Ben Hassine

Build result summary

Details

Completed
Duration
2 minutes
Labels
None
Agent
bamboo-22.af.pivotal.io
Revision
38b43e8aaf7dfd2dfb8e58831baca88f2f0185a3 38b43e8aaf7dfd2dfb8e58831baca88f2f0185a3
Total tests
1913
Failing since
#601 (Manual run by Mahmoud Ben Hassine)
Fixed in
#603 (Manual run by Mahmoud Ben Hassine)

Tests

Responsible

This build has been failing since #601
No one has taken responsibility

Configuration changes

Plan configuration has changed since the last successful build. See the plan audit log for more details.

Tests

New test failures 1
Status Test View job Duration
Collapse Failed JsrSplitParsingTests test History
Default Job < 1 sec
java.lang.AssertionError: java.lang.AssertionError: expected:<COMPLETED> but was:<FAILED>
java.lang.AssertionError: expected:<COMPLETED> but was:<FAILED>
	at org.junit.Assert.fail(Assert.java:88)
	at org.junit.Assert.failNotEquals(Assert.java:834)
	at org.junit.Assert.assertEquals(Assert.java:118)
	at org.junit.Assert.assertEquals(Assert.java:144)
	at org.springframework.batch.core.jsr.configuration.xml.JsrSplitParsingTests.test(JsrSplitParsingTests.java:49)
	at sun.reflect.NativeMethodAccessorImpl.invoke0(Native Method)
(46 more lines...)