Build #609

Gradle build for Spring Batch

Build: #609 failed Changes by Wannes <wa_voe@hotmail.com>

Build result summary

Details

Completed
Duration
3 minutes
Labels
None
Agent
bamboo-20.af.pivotal.io
Revision
bcc4665faa313af6200cca387c3a848217e7f058 bcc4665faa313af6200cca387c3a848217e7f058
Total tests
1913
Fixed in
#610 (Changes by Benoit Dupont <benoit.dupont@ehealth.fgov.be>)

Tests

Responsible

No one has taken responsibility for this failure

Code commits

Author Commit Message Commit date
Wannes <wa_voe@hotmail.com> Wannes <wa_voe@hotmail.com> bcc4665faa313af6200cca387c3a848217e7f058 bcc4665faa313af6200cca387c3a848217e7f058 Update step.adoc
typo in a variable

Tests

New test failures 1
Status Test View job Duration
Collapse Failed DecisionStepTests testDecisionAfterSplit History
Default Job < 1 sec
java.lang.AssertionError: java.lang.AssertionError: Received a FAILED because of org.springframework.batch.core.JobExecutionException: Flow execution ended unexpectedly
	at org.springframework.batch.core.jsr.job.flow.JsrFlowJob.doExecute(JsrFlowJob.java:88)
	at org.springframework.batch.core.job.AbstractJob.execute(AbstractJob.java:319)
	at org.springframework.batch.core.jsr.launch.JsrJobOperator$2.run(JsrJobOperator.java:674)
	at java.lang.Thread.run(Thread.java:748)
Caused by: org.springframework.batch.core.job.flow.FlowExecutionException: Ended flow=flow2.step1 at state=flow2.step1.flow2.step1 with exception
	at org.springframework.batch.core.job.flow.support.SimpleFlow.resume(SimpleFlow.java:178)
	at org.springframework.batch.core.job.flow.support.SimpleFlow.start(SimpleFlow.java:144)
(92 more lines...)