Build #609

Gradle build for Spring Batch

Build: #609 failed Changes by Wannes <wa_voe@hotmail.com>

Test results

  • 1,913 tests in total
  • 1 test failed
  • 1 failure is new
  • 7 tests were quarantined / skipped
  • 42 seconds taken in total.
New test failures 1
Status Test View job Duration
Collapse Failed DecisionStepTests testDecisionAfterSplit History
Default Job < 1 sec
java.lang.AssertionError: java.lang.AssertionError: Received a FAILED because of org.springframework.batch.core.JobExecutionException: Flow execution ended unexpectedly
	at org.springframework.batch.core.jsr.job.flow.JsrFlowJob.doExecute(JsrFlowJob.java:88)
	at org.springframework.batch.core.job.AbstractJob.execute(AbstractJob.java:319)
	at org.springframework.batch.core.jsr.launch.JsrJobOperator$2.run(JsrJobOperator.java:674)
	at java.lang.Thread.run(Thread.java:748)
Caused by: org.springframework.batch.core.job.flow.FlowExecutionException: Ended flow=flow2.step1 at state=flow2.step1.flow2.step1 with exception
	at org.springframework.batch.core.job.flow.support.SimpleFlow.resume(SimpleFlow.java:178)
	at org.springframework.batch.core.job.flow.support.SimpleFlow.start(SimpleFlow.java:144)
(92 more lines...)
Skipped tests 7
Status Test Failing since View job
Skipped ItemListenerErrorTests testOnReadError History
Default Job
Skipped JobRepositoryFactoryBeanTests testTransactionAttributesForCreateMethodNullHypothesis History
Default Job
Skipped StepScopeClassIntegrationTests testSimpleValue History
Default Job
Skipped StepScopeClassIntegrationTests testNested History
Default Job
Skipped FaultTolerantStepFactoryBeanUnexpectedRollbackTests testTransactionException History
Default Job
Skipped AsyncChunkOrientedStepIntegrationTests testStatus History
Default Job
Skipped ChunkOrientedStepIntegrationTests testStatusForCommitFailedException History
Default Job