Build #612

Gradle build for Spring Batch

Build: #612 failed Changes by Mahmoud Ben Hassine

Build result summary

Details

Completed
Duration
3 minutes
Labels
None
Agent
bamboo-23.af.pivotal.io
Revision
ff5578851fb33dedd57c5ccf5dd71e430040570d ff5578851fb33dedd57c5ccf5dd71e430040570d
Total tests
1913
Fixed in
#613 (Changes by Michael Minella)

Tests

Responsible

Code commits

Author Commit Message Commit date
Mahmoud Ben Hassine Mahmoud Ben Hassine ff5578851fb33dedd57c5ccf5dd71e430040570d ff5578851fb33dedd57c5ccf5dd71e430040570d Upgrade Spring Data MongoDB to version 3.0.0.BUILD-SNAPSHOT

Tests

New test failures 1
Status Test View job Duration
Collapse Failed JsrSplitParsingTests test History
Default Job < 1 sec
java.lang.AssertionError: java.lang.AssertionError: expected:<COMPLETED> but was:<FAILED>
java.lang.AssertionError: expected:<COMPLETED> but was:<FAILED>
	at org.junit.Assert.fail(Assert.java:89)
	at org.junit.Assert.failNotEquals(Assert.java:835)
	at org.junit.Assert.assertEquals(Assert.java:120)
	at org.junit.Assert.assertEquals(Assert.java:146)
	at org.springframework.batch.core.jsr.configuration.xml.JsrSplitParsingTests.test(JsrSplitParsingTests.java:49)
	at sun.reflect.NativeMethodAccessorImpl.invoke0(Native Method)
(48 more lines...)