Build #617

Gradle build for Spring Batch

Build: #617 failed Changes by Mahmoud Ben Hassine

Build result summary

Details

Completed
Duration
3 minutes
Labels
None
Agent
bamboo-17.af.pivotal.io
Revision
ad3dcbc96afcef6e6d7dce75c5c208e540adf789 ad3dcbc96afcef6e6d7dce75c5c208e540adf789
Total tests
1914
Fixed in
#618 (Changes by Chris Schaefer)

Tests

Responsible

Code commits

Author Commit Message Commit date
Mahmoud Ben Hassine Mahmoud Ben Hassine ad3dcbc96afcef6e6d7dce75c5c208e540adf789 ad3dcbc96afcef6e6d7dce75c5c208e540adf789 Remove Gitter link from README.md

Tests

New test failures 2
Status Test View job Duration
Collapse Failed JsrSplitParsingTests test History
Default Job < 1 sec
java.lang.AssertionError: java.lang.AssertionError: expected:<COMPLETED> but was:<FAILED>
java.lang.AssertionError: expected:<COMPLETED> but was:<FAILED>
	at org.junit.Assert.fail(Assert.java:89)
	at org.junit.Assert.failNotEquals(Assert.java:835)
	at org.junit.Assert.assertEquals(Assert.java:120)
	at org.junit.Assert.assertEquals(Assert.java:146)
	at org.springframework.batch.core.jsr.configuration.xml.JsrSplitParsingTests.test(JsrSplitParsingTests.java:49)
	at sun.reflect.NativeMethodAccessorImpl.invoke0(Native Method)
(48 more lines...)
Collapse Failed DecisionStepTests testDecisionAfterSplit History
Default Job < 1 sec
java.lang.AssertionError: java.lang.AssertionError: Received a FAILED because of  expected:<COMPLETED> but was:<FAILED>
java.lang.AssertionError: Received a FAILED because of  expected:<COMPLETED> but was:<FAILED>
	at org.junit.Assert.fail(Assert.java:89)
	at org.junit.Assert.failNotEquals(Assert.java:835)
	at org.junit.Assert.assertEquals(Assert.java:120)
	at org.springframework.batch.core.jsr.step.DecisionStepTests.testDecisionAfterSplit(DecisionStepTests.java:113)
	at sun.reflect.NativeMethodAccessorImpl.invoke0(Native Method)
	at sun.reflect.NativeMethodAccessorImpl.invoke(NativeMethodAccessorImpl.java:62)
(47 more lines...)