Build #620

Gradle build for Spring Batch

Build: #620 failed Changes by Mahmoud Ben Hassine

Build result summary

Details

Completed
Duration
3 minutes
Labels
None
Agent
bamboo-19.af.pivotal.io
Revision
f94446878ba7e070c95b3b7e53d1f8491f1126c5 f94446878ba7e070c95b3b7e53d1f8491f1126c5
Total tests
1914
Fixed in
#621 (Changes by Mahmoud Ben Hassine)

Tests

Responsible

Code commits

Author Commit Message Commit date
Mahmoud Ben Hassine Mahmoud Ben Hassine f94446878ba7e070c95b3b7e53d1f8491f1126c5 f94446878ba7e070c95b3b7e53d1f8491f1126c5 Fix line tokenizer validation in FlatFileItemReaderBuilder
Resolves #766

Tests

New test failures 1
Status Test View job Duration
Collapse Failed JsrSplitParsingTests test History
Default Job < 1 sec
java.lang.AssertionError: java.lang.AssertionError: expected:<COMPLETED> but was:<FAILED>
java.lang.AssertionError: expected:<COMPLETED> but was:<FAILED>
	at org.junit.Assert.fail(Assert.java:89)
	at org.junit.Assert.failNotEquals(Assert.java:835)
	at org.junit.Assert.assertEquals(Assert.java:120)
	at org.junit.Assert.assertEquals(Assert.java:146)
	at org.springframework.batch.core.jsr.configuration.xml.JsrSplitParsingTests.test(JsrSplitParsingTests.java:49)
	at sun.reflect.NativeMethodAccessorImpl.invoke0(Native Method)
(48 more lines...)