Build #689

Gradle build for Spring Batch

Build: #689 failed Rebuilt by Mahmoud Ben Hassine

Build result summary

Details

Completed
Duration
2 minutes
Labels
None
Agent
bamboo-13.af.pivotal.io
Revision
744d1834fe313204f06c0bcd0eedd472ab4af6be 744d1834fe313204f06c0bcd0eedd472ab4af6be
Total tests
1925
Fixed in
#692 (Rebuilt by Mahmoud Ben Hassine)
Number of retries
1

Tests

Responsible

No one has taken responsibility for this failure

Code commits

Author Commit Message Commit date
Mahmoud Ben Hassine <mbenhassine@vmware.com> Mahmoud Ben Hassine <mbenhassine@vmware.com> 744d1834fe313204f06c0bcd0eedd472ab4af6be 744d1834fe313204f06c0bcd0eedd472ab4af6be Add support for annotation based listeners in JobBuilder
Resolves #817

Tests

New test failures 1
Status Test View job Duration
Collapse Failed JsrSplitParsingTests test History
Default Job < 1 sec
java.lang.AssertionError: java.lang.AssertionError: expected:<COMPLETED> but was:<FAILED>
java.lang.AssertionError: expected:<COMPLETED> but was:<FAILED>
	at org.junit.Assert.fail(Assert.java:89)
	at org.junit.Assert.failNotEquals(Assert.java:835)
	at org.junit.Assert.assertEquals(Assert.java:120)
	at org.junit.Assert.assertEquals(Assert.java:146)
	at org.springframework.batch.core.jsr.configuration.xml.JsrSplitParsingTests.test(JsrSplitParsingTests.java:49)
	at sun.reflect.NativeMethodAccessorImpl.invoke0(Native Method)
(48 more lines...)