Build #485

Gradle build for Spring Batch

Build: #485 failed Changes by Mahmoud Ben Hassine

Build result summary

Details

Completed
Duration
9 minutes
Labels
None
Agent
bamboo-08.af.pivotal.io
Revision
ed84a8cb29ba987cd58aaf67293e423ec54aed14 ed84a8cb29ba987cd58aaf67293e423ec54aed14
Total tests
1900
Failing since
#481 (Changes by Drummond Dawson <drumonii@users.noreply.github.com>)

Responsible

This build has been failing since #481
No one has taken responsibility

Code commits

Author Commit Message Commit date
Mahmoud Ben Hassine Mahmoud Ben Hassine ed84a8cb29ba987cd58aaf67293e423ec54aed14 ed84a8cb29ba987cd58aaf67293e423ec54aed14 Fix id of scalability#partitioner section in documentation

Tests

New test failures 1
Status Test View job Duration
Collapse Failed JsrSplitParsingTests test History
Default Job < 1 sec
java.lang.AssertionError: java.lang.AssertionError: expected:<COMPLETED> but was:<FAILED>
java.lang.AssertionError: expected:<COMPLETED> but was:<FAILED>
	at org.junit.Assert.fail(Assert.java:88)
	at org.junit.Assert.failNotEquals(Assert.java:834)
	at org.junit.Assert.assertEquals(Assert.java:118)
	at org.junit.Assert.assertEquals(Assert.java:144)
	at org.springframework.batch.core.jsr.configuration.xml.JsrSplitParsingTests.test(JsrSplitParsingTests.java:49)
	at sun.reflect.NativeMethodAccessorImpl.invoke0(Native Method)
(46 more lines...)