Build #34

Gradle build for Spring Batch

Build: #34 failed Changes by Mahmoud Ben Hassine

Build result summary

Details

Completed
Duration
3 minutes
Labels
None
Agent
bamboo-17.af.pivotal.io
Revision
06212e91aa39c590390116780c400b214b2554d4 06212e91aa39c590390116780c400b214b2554d4
Total tests
1914

Tests

Responsible

Code commits

Author Commit Message Commit date
Mahmoud Ben Hassine Mahmoud Ben Hassine 06212e91aa39c590390116780c400b214b2554d4 06212e91aa39c590390116780c400b214b2554d4 Update Spring projects dependencies to latest BUILD-SNAPSHOT

Tests

New test failures 1
Status Test View job Duration
Collapse Failed JsrSplitParsingTests test History
Default Job < 1 sec
java.lang.AssertionError: java.lang.AssertionError: expected:<COMPLETED> but was:<FAILED>
java.lang.AssertionError: expected:<COMPLETED> but was:<FAILED>
	at org.junit.Assert.fail(Assert.java:89)
	at org.junit.Assert.failNotEquals(Assert.java:835)
	at org.junit.Assert.assertEquals(Assert.java:120)
	at org.junit.Assert.assertEquals(Assert.java:146)
	at org.springframework.batch.core.jsr.configuration.xml.JsrSplitParsingTests.test(JsrSplitParsingTests.java:49)
	at sun.reflect.NativeMethodAccessorImpl.invoke0(Native Method)
(48 more lines...)