Build to verify Spring IO compatibility.

Build: #386 failed Changes by Mahmoud Ben Hassine and Jay Bryant

Build result summary

Details

Completed
Duration
2 minutes
Labels
None
Agent
bamboo-11.af.pivotal.io
Revision
3bc00a7c07720fdd6de81a9510ab26912bf6ce10 3bc00a7c07720fdd6de81a9510ab26912bf6ce10
Total tests
3411
Failing since
#385 (Changes by Mahmoud Ben Hassine and Saikat Bhadra <saikat.bhadra@gmail.com>)

Responsible

Code commits

Author Commit Message Commit date
Mahmoud Ben Hassine Mahmoud Ben Hassine 3bc00a7c07720fdd6de81a9510ab26912bf6ce10 3bc00a7c07720fdd6de81a9510ab26912bf6ce10 Fix batch metrics test
Micrometer's global registry might contain other metrics than
those from Spring Batch. This commit updates the test to expect
at least those from Spring Batch to be registered.

Issue BATCH-2774
Mahmoud Ben Hassine Mahmoud Ben Hassine b24a05d532e7bfa5ed7d3839882c512fd116a837 b24a05d532e7bfa5ed7d3839882c512fd116a837 Upgrade dependencies
Mahmoud Ben Hassine Mahmoud Ben Hassine 57c8d70ff3f400b54389337809332eebb14d87a2 57c8d70ff3f400b54389337809332eebb14d87a2 Initial support for batch metrics with Micrometer
Implements BATCH-2774
Jay Bryant Jay Bryant 145bacc34a3e2d7f127a922308c78411dac272b9 145bacc34a3e2d7f127a922308c78411dac272b9 Use spring-doc-resources

Tests

Existing test failures 20
Status Test Failing since View job Duration
org.junit.ComparisonFailure: org.junit.ComparisonFailure: expected:<{[]}> but was:<{[ ]}>
org.junit.ComparisonFailure: expected:<{[]}> but was:<{[ ]}>
	at org.junit.Assert.assertEquals(Assert.java:115)
	at org.junit.Assert.assertEquals(Assert.java:144)
	at org.springframework.batch.item.data.MongoItemReaderTests.testQueryWithFields(MongoItemReaderTests.java:173)
	at sun.reflect.NativeMethodAccessorImpl.invoke0(Native Method)
	at sun.reflect.NativeMethodAccessorImpl.invoke(NativeMethodAccessorImpl.java:62)
	at sun.reflect.DelegatingMethodAccessorImpl.invoke(DelegatingMethodAccessorImpl.java:43)
(43 more lines...)
org.junit.ComparisonFailure: org.junit.ComparisonFailure: expected:<{[]}> but was:<{[ ]}>
org.junit.ComparisonFailure: expected:<{[]}> but was:<{[ ]}>
	at org.junit.Assert.assertEquals(Assert.java:115)
	at org.junit.Assert.assertEquals(Assert.java:144)
	at org.springframework.batch.item.data.MongoItemReaderTests.testQueryWithHint(MongoItemReaderTests.java:192)
	at sun.reflect.NativeMethodAccessorImpl.invoke0(Native Method)
	at sun.reflect.NativeMethodAccessorImpl.invoke(NativeMethodAccessorImpl.java:62)
	at sun.reflect.DelegatingMethodAccessorImpl.invoke(DelegatingMethodAccessorImpl.java:43)
(43 more lines...)
org.junit.ComparisonFailure: org.junit.ComparisonFailure: expected:<{[]}> but was:<{[ ]}>
org.junit.ComparisonFailure: expected:<{[]}> but was:<{[ ]}>
	at org.junit.Assert.assertEquals(Assert.java:115)
	at org.junit.Assert.assertEquals(Assert.java:144)
	at org.springframework.batch.item.data.MongoItemReaderTests.testBasicQuerySecondPage(MongoItemReaderTests.java:156)
	at sun.reflect.NativeMethodAccessorImpl.invoke0(Native Method)
	at sun.reflect.NativeMethodAccessorImpl.invoke(NativeMethodAccessorImpl.java:62)
	at sun.reflect.DelegatingMethodAccessorImpl.invoke(DelegatingMethodAccessorImpl.java:43)
(43 more lines...)
org.junit.ComparisonFailure: org.junit.ComparisonFailure: expected:<{[]}> but was:<{[ ]}>
org.junit.ComparisonFailure: expected:<{[]}> but was:<{[ ]}>
	at org.junit.Assert.assertEquals(Assert.java:115)
	at org.junit.Assert.assertEquals(Assert.java:144)
	at org.springframework.batch.item.data.MongoItemReaderTests.testBasicQueryFirstPage(MongoItemReaderTests.java:139)
	at sun.reflect.NativeMethodAccessorImpl.invoke0(Native Method)
	at sun.reflect.NativeMethodAccessorImpl.invoke(NativeMethodAccessorImpl.java:62)
	at sun.reflect.DelegatingMethodAccessorImpl.invoke(DelegatingMethodAccessorImpl.java:43)
(43 more lines...)
org.junit.ComparisonFailure: org.junit.ComparisonFailure: expected:<{["name": "foo"]}> but was:<{[ "name" : "foo" ]}>
org.junit.ComparisonFailure: expected:<{["name": "foo"]}> but was:<{[ "name" : "foo" ]}>
	at org.junit.Assert.assertEquals(Assert.java:115)
	at org.junit.Assert.assertEquals(Assert.java:144)
	at org.springframework.batch.item.data.MongoItemReaderTests.testQueryWithParameters(MongoItemReaderTests.java:214)
	at sun.reflect.NativeMethodAccessorImpl.invoke0(Native Method)
	at sun.reflect.NativeMethodAccessorImpl.invoke(NativeMethodAccessorImpl.java:62)
	at sun.reflect.DelegatingMethodAccessorImpl.invoke(DelegatingMethodAccessorImpl.java:43)
(43 more lines...)
org.junit.ComparisonFailure: org.junit.ComparisonFailure: expected:<{["name": "foo"]}> but was:<{[ "name" : "foo" ]}>
org.junit.ComparisonFailure: expected:<{["name": "foo"]}> but was:<{[ "name" : "foo" ]}>
	at org.junit.Assert.assertEquals(Assert.java:115)
	at org.junit.Assert.assertEquals(Assert.java:144)
	at org.springframework.batch.item.data.MongoItemReaderTests.testQueryWithCollection(MongoItemReaderTests.java:237)
	at sun.reflect.NativeMethodAccessorImpl.invoke0(Native Method)
	at sun.reflect.NativeMethodAccessorImpl.invoke(NativeMethodAccessorImpl.java:62)
	at sun.reflect.DelegatingMethodAccessorImpl.invoke(DelegatingMethodAccessorImpl.java:43)
(43 more lines...)
java.lang.NoSuchMethodError: java.lang.NoSuchMethodError: org.springframework.data.mongodb.core.MongoOperations.save(Ljava/lang/Object;)Ljava/lang/Object;
java.lang.NoSuchMethodError: org.springframework.data.mongodb.core.MongoOperations.save(Ljava/lang/Object;)Ljava/lang/Object;
	at org.springframework.batch.item.data.MongoItemWriter.doWrite(MongoItemWriter.java:143)
	at org.springframework.batch.item.data.MongoItemWriter$1.beforeCommit(MongoItemWriter.java:166)
	at org.springframework.transaction.support.TransactionSynchronizationUtils.triggerBeforeCommit(TransactionSynchronizationUtils.java:96)
	at org.springframework.transaction.support.AbstractPlatformTransactionManager.triggerBeforeCommit(AbstractPlatformTransactionManager.java:922)
	at org.springframework.transaction.support.AbstractPlatformTransactionManager.processCommit(AbstractPlatformTransactionManager.java:730)
	at org.springframework.transaction.support.AbstractPlatformTransactionManager.commit(AbstractPlatformTransactionManager.java:714)
(48 more lines...)
java.lang.NoSuchMethodError: java.lang.NoSuchMethodError: org.springframework.data.mongodb.core.MongoOperations.save(Ljava/lang/Object;)Ljava/lang/Object;
java.lang.NoSuchMethodError: org.springframework.data.mongodb.core.MongoOperations.save(Ljava/lang/Object;)Ljava/lang/Object;
	at org.springframework.batch.item.data.MongoItemWriterTests.testResourceKeyCollision(MongoItemWriterTests.java:257)
	at sun.reflect.NativeMethodAccessorImpl.invoke0(Native Method)
	at sun.reflect.NativeMethodAccessorImpl.invoke(NativeMethodAccessorImpl.java:62)
	at sun.reflect.DelegatingMethodAccessorImpl.invoke(DelegatingMethodAccessorImpl.java:43)
	at java.lang.reflect.Method.invoke(Method.java:498)
	at org.junit.runners.model.FrameworkMethod$1.runReflectiveCall(FrameworkMethod.java:50)
(41 more lines...)
org.mockito.exceptions.misusing.InvalidUseOfMatchersException: org.mockito.exceptions.misusing.InvalidUseOfMatchersException: 
Misplaced or misused argument matcher detected here:

-> at org.springframework.batch.item.data.MongoItemWriterTests.testResourceKeyCollision(MongoItemWriterTests.java:257)

You cannot use argument matchers outside of verification or stubbing.
Examples of correct usage of argument matchers:
    when(mock.get(anyInt())).thenReturn(null);
(80 more lines...)
java.lang.NoSuchMethodError: java.lang.NoSuchMethodError: org.springframework.data.mongodb.core.MongoOperations.save(Ljava/lang/Object;Ljava/lang/String;)Ljava/lang/Object;
java.lang.NoSuchMethodError: org.springframework.data.mongodb.core.MongoOperations.save(Ljava/lang/Object;Ljava/lang/String;)Ljava/lang/Object;
	at org.springframework.batch.item.data.MongoItemWriter.doWrite(MongoItemWriter.java:138)
	at org.springframework.batch.item.data.MongoItemWriter$1.beforeCommit(MongoItemWriter.java:166)
	at org.springframework.transaction.support.TransactionSynchronizationUtils.triggerBeforeCommit(TransactionSynchronizationUtils.java:96)
	at org.springframework.transaction.support.AbstractPlatformTransactionManager.triggerBeforeCommit(AbstractPlatformTransactionManager.java:922)
	at org.springframework.transaction.support.AbstractPlatformTransactionManager.processCommit(AbstractPlatformTransactionManager.java:730)
	at org.springframework.transaction.support.AbstractPlatformTransactionManager.commit(AbstractPlatformTransactionManager.java:714)
(48 more lines...)
org.mockito.exceptions.misusing.UnfinishedStubbingException: org.mockito.exceptions.misusing.UnfinishedStubbingException: 
Unfinished stubbing detected here:
-> at org.springframework.batch.item.data.MongoItemWriterTests.testResourceKeyCollision(MongoItemWriterTests.java:249)

E.g. thenReturn() may be missing.
Examples of correct stubbing:
    when(mock.isOk()).thenReturn(true);
    when(mock.isOk()).thenThrow(exception);
(67 more lines...)
java.lang.NoSuchMethodError: java.lang.NoSuchMethodError: org.springframework.data.mongodb.core.MongoOperations.save(Ljava/lang/Object;Ljava/lang/String;)Ljava/lang/Object;
java.lang.NoSuchMethodError: org.springframework.data.mongodb.core.MongoOperations.save(Ljava/lang/Object;Ljava/lang/String;)Ljava/lang/Object;
	at org.springframework.batch.item.data.MongoItemWriter.doWrite(MongoItemWriter.java:138)
	at org.springframework.batch.item.data.MongoItemWriter.write(MongoItemWriter.java:107)
	at org.springframework.batch.item.data.MongoItemWriterTests.testWriteNoTransactionWithCollection(MongoItemWriterTests.java:93)
	at sun.reflect.NativeMethodAccessorImpl.invoke0(Native Method)
	at sun.reflect.NativeMethodAccessorImpl.invoke(NativeMethodAccessorImpl.java:62)
	at sun.reflect.DelegatingMethodAccessorImpl.invoke(DelegatingMethodAccessorImpl.java:43)
(43 more lines...)
java.lang.NoSuchMethodError: java.lang.NoSuchMethodError: org.springframework.data.mongodb.core.MongoOperations.save(Ljava/lang/Object;)Ljava/lang/Object;
java.lang.NoSuchMethodError: org.springframework.data.mongodb.core.MongoOperations.save(Ljava/lang/Object;)Ljava/lang/Object;
	at org.springframework.batch.item.data.MongoItemWriter.doWrite(MongoItemWriter.java:143)
	at org.springframework.batch.item.data.MongoItemWriter.write(MongoItemWriter.java:107)
	at org.springframework.batch.item.data.MongoItemWriterTests.testWriteNoTransactionNoCollection(MongoItemWriterTests.java:78)
	at sun.reflect.NativeMethodAccessorImpl.invoke0(Native Method)
	at sun.reflect.NativeMethodAccessorImpl.invoke(NativeMethodAccessorImpl.java:62)
	at sun.reflect.DelegatingMethodAccessorImpl.invoke(DelegatingMethodAccessorImpl.java:43)
(43 more lines...)
org.junit.ComparisonFailure: org.junit.ComparisonFailure: expected:<{["name": "foo"]}> but was:<{[ "name" : "foo" ]}>
org.junit.ComparisonFailure: expected:<{["name": "foo"]}> but was:<{[ "name" : "foo" ]}>
	at org.junit.Assert.assertEquals(Assert.java:115)
	at org.junit.Assert.assertEquals(Assert.java:144)
	at org.springframework.batch.item.data.builder.MongoItemReaderBuilderTests.testVarargs(MongoItemReaderBuilderTests.java:143)
	at sun.reflect.NativeMethodAccessorImpl.invoke0(Native Method)
	at sun.reflect.NativeMethodAccessorImpl.invoke(NativeMethodAccessorImpl.java:62)
	at sun.reflect.DelegatingMethodAccessorImpl.invoke(DelegatingMethodAccessorImpl.java:43)
(43 more lines...)
org.junit.ComparisonFailure: org.junit.ComparisonFailure: expected:<{[]}> but was:<{[ ]}>
org.junit.ComparisonFailure: expected:<{[]}> but was:<{[ ]}>
	at org.junit.Assert.assertEquals(Assert.java:115)
	at org.junit.Assert.assertEquals(Assert.java:144)
	at org.springframework.batch.item.data.builder.MongoItemReaderBuilderTests.testBasic(MongoItemReaderBuilderTests.java:72)
	at sun.reflect.NativeMethodAccessorImpl.invoke0(Native Method)
	at sun.reflect.NativeMethodAccessorImpl.invoke(NativeMethodAccessorImpl.java:62)
	at sun.reflect.DelegatingMethodAccessorImpl.invoke(DelegatingMethodAccessorImpl.java:43)
(43 more lines...)
org.junit.ComparisonFailure: org.junit.ComparisonFailure: expected:<{["name": "foo"]}> but was:<{[ "name" : "foo" ]}>
org.junit.ComparisonFailure: expected:<{["name": "foo"]}> but was:<{[ "name" : "foo" ]}>
	at org.junit.Assert.assertEquals(Assert.java:115)
	at org.junit.Assert.assertEquals(Assert.java:144)
	at org.springframework.batch.item.data.builder.MongoItemReaderBuilderTests.testCollection(MongoItemReaderBuilderTests.java:122)
	at sun.reflect.NativeMethodAccessorImpl.invoke0(Native Method)
	at sun.reflect.NativeMethodAccessorImpl.invoke(NativeMethodAccessorImpl.java:62)
	at sun.reflect.DelegatingMethodAccessorImpl.invoke(DelegatingMethodAccessorImpl.java:43)
(43 more lines...)
java.lang.NoSuchMethodError: java.lang.NoSuchMethodError: org.springframework.data.mongodb.core.MongoOperations.save(Ljava/lang/Object;)Ljava/lang/Object;
java.lang.NoSuchMethodError: org.springframework.data.mongodb.core.MongoOperations.save(Ljava/lang/Object;)Ljava/lang/Object;
	at org.springframework.batch.item.data.MongoItemWriter.doWrite(MongoItemWriter.java:143)
	at org.springframework.batch.item.data.MongoItemWriter.write(MongoItemWriter.java:107)
	at org.springframework.batch.item.data.builder.MongoItemWriterBuilderTests.testBasicWrite(MongoItemWriterBuilderTests.java:53)
	at sun.reflect.NativeMethodAccessorImpl.invoke0(Native Method)
	at sun.reflect.NativeMethodAccessorImpl.invoke(NativeMethodAccessorImpl.java:62)
	at sun.reflect.DelegatingMethodAccessorImpl.invoke(DelegatingMethodAccessorImpl.java:43)
(43 more lines...)
java.lang.NoSuchMethodError: java.lang.NoSuchMethodError: org.springframework.data.mongodb.core.MongoOperations.save(Ljava/lang/Object;)Ljava/lang/Object;
java.lang.NoSuchMethodError: org.springframework.data.mongodb.core.MongoOperations.save(Ljava/lang/Object;)Ljava/lang/Object;
	at org.springframework.batch.item.data.builder.MongoItemWriterBuilderTests.testDelete(MongoItemWriterBuilderTests.java:71)
	at sun.reflect.NativeMethodAccessorImpl.invoke0(Native Method)
	at sun.reflect.NativeMethodAccessorImpl.invoke(NativeMethodAccessorImpl.java:62)
	at sun.reflect.DelegatingMethodAccessorImpl.invoke(DelegatingMethodAccessorImpl.java:43)
	at java.lang.reflect.Method.invoke(Method.java:498)
	at org.junit.runners.model.FrameworkMethod$1.runReflectiveCall(FrameworkMethod.java:50)
(41 more lines...)
java.lang.NoSuchMethodError: java.lang.NoSuchMethodError: org.springframework.data.mongodb.core.MongoOperations.save(Ljava/lang/Object;Ljava/lang/String;)Ljava/lang/Object;
java.lang.NoSuchMethodError: org.springframework.data.mongodb.core.MongoOperations.save(Ljava/lang/Object;Ljava/lang/String;)Ljava/lang/Object;
	at org.springframework.batch.item.data.MongoItemWriter.doWrite(MongoItemWriter.java:138)
	at org.springframework.batch.item.data.MongoItemWriter.write(MongoItemWriter.java:107)
	at org.springframework.batch.item.data.builder.MongoItemWriterBuilderTests.testWriteToCollection(MongoItemWriterBuilderTests.java:81)
	at sun.reflect.NativeMethodAccessorImpl.invoke0(Native Method)
	at sun.reflect.NativeMethodAccessorImpl.invoke(NativeMethodAccessorImpl.java:62)
	at sun.reflect.DelegatingMethodAccessorImpl.invoke(DelegatingMethodAccessorImpl.java:43)
(43 more lines...)
org.mockito.exceptions.misusing.UnfinishedVerificationException: org.mockito.exceptions.misusing.UnfinishedVerificationException: 
Missing method call for verify(mock) here:
-> at org.springframework.batch.item.data.builder.MongoItemWriterBuilderTests.testDelete(MongoItemWriterBuilderTests.java:71)

Example of correct verification:
    verify(mock).doSomething()

Also, this error might show up because you verify either of: final/private/equals()/hashCode() methods.
(60 more lines...)
Fixed tests 46
Status Test Failing since View job Duration
Successful HibernateCursorItemReaderCommonTests testRead History
Failing since build #385 (Changes by Mahmoud Ben Hassine and Saikat Bhadra <saikat.bhadra@gmail.com>) Default Job < 1 sec
Successful HibernateCursorItemReaderCommonTests testRestart History
Failing since build #385 (Changes by Mahmoud Ben Hassine and Saikat Bhadra <saikat.bhadra@gmail.com>) Default Job < 1 sec
Successful HibernateCursorItemReaderCommonTests testReopen History
Failing since build #385 (Changes by Mahmoud Ben Hassine and Saikat Bhadra <saikat.bhadra@gmail.com>) Default Job < 1 sec
Successful HibernateCursorItemReaderCommonTests testResetAndRestart History
Failing since build #385 (Changes by Mahmoud Ben Hassine and Saikat Bhadra <saikat.bhadra@gmail.com>) Default Job < 1 sec
Successful HibernateCursorItemReaderCommonTests testReadToExhaustion History
Failing since build #385 (Changes by Mahmoud Ben Hassine and Saikat Bhadra <saikat.bhadra@gmail.com>) Default Job < 1 sec
Successful HibernateCursorItemReaderCommonTests testEmptyInput History
Failing since build #385 (Changes by Mahmoud Ben Hassine and Saikat Bhadra <saikat.bhadra@gmail.com>) Default Job < 1 sec
Successful HibernateCursorItemReaderIntegrationTests testNormalProcessing History
Failing since build #385 (Changes by Mahmoud Ben Hassine and Saikat Bhadra <saikat.bhadra@gmail.com>) Default Job < 1 sec
Successful HibernateCursorItemReaderIntegrationTests testRollbackOnFirstChunkAndRestart History
Failing since build #385 (Changes by Mahmoud Ben Hassine and Saikat Bhadra <saikat.bhadra@gmail.com>) Default Job < 1 sec
Successful HibernateCursorItemReaderIntegrationTests testRestartOnSecondPage History
Failing since build #385 (Changes by Mahmoud Ben Hassine and Saikat Bhadra <saikat.bhadra@gmail.com>) Default Job < 1 sec
Successful HibernateCursorItemReaderIntegrationTests testMultipleRestarts History
Failing since build #385 (Changes by Mahmoud Ben Hassine and Saikat Bhadra <saikat.bhadra@gmail.com>) Default Job < 1 sec
Successful HibernateCursorItemReaderIntegrationTests testRollbackAndRestart History
Failing since build #385 (Changes by Mahmoud Ben Hassine and Saikat Bhadra <saikat.bhadra@gmail.com>) Default Job < 1 sec
Successful HibernateCursorItemReaderIntegrationTests testInvalidRestore History
Failing since build #385 (Changes by Mahmoud Ben Hassine and Saikat Bhadra <saikat.bhadra@gmail.com>) Default Job < 1 sec
Successful HibernateCursorItemReaderIntegrationTests testSetUseStatelessSession History
Failing since build #385 (Changes by Mahmoud Ben Hassine and Saikat Bhadra <saikat.bhadra@gmail.com>) Default Job < 1 sec
Successful HibernateCursorItemReaderIntegrationTests testRestoreFromEmptyData History
Failing since build #385 (Changes by Mahmoud Ben Hassine and Saikat Bhadra <saikat.bhadra@gmail.com>) Default Job < 1 sec
Successful HibernateCursorItemReaderIntegrationTests testRestart History
Failing since build #385 (Changes by Mahmoud Ben Hassine and Saikat Bhadra <saikat.bhadra@gmail.com>) Default Job < 1 sec
Successful HibernateCursorItemReaderNamedQueryIntegrationTests testRestoreFromEmptyData History
Failing since build #385 (Changes by Mahmoud Ben Hassine and Saikat Bhadra <saikat.bhadra@gmail.com>) Default Job < 1 sec
Successful HibernateCursorItemReaderNamedQueryIntegrationTests testInvalidRestore History
Failing since build #385 (Changes by Mahmoud Ben Hassine and Saikat Bhadra <saikat.bhadra@gmail.com>) Default Job < 1 sec
Successful HibernateCursorItemReaderNamedQueryIntegrationTests testRestartOnSecondPage History
Failing since build #385 (Changes by Mahmoud Ben Hassine and Saikat Bhadra <saikat.bhadra@gmail.com>) Default Job < 1 sec
Successful HibernateCursorItemReaderNamedQueryIntegrationTests testRollbackAndRestart History
Failing since build #385 (Changes by Mahmoud Ben Hassine and Saikat Bhadra <saikat.bhadra@gmail.com>) Default Job < 1 sec
Successful HibernateCursorItemReaderNamedQueryIntegrationTests testRollbackOnFirstChunkAndRestart History
Failing since build #385 (Changes by Mahmoud Ben Hassine and Saikat Bhadra <saikat.bhadra@gmail.com>) Default Job < 1 sec
Successful HibernateCursorItemReaderNamedQueryIntegrationTests testNormalProcessing History
Failing since build #385 (Changes by Mahmoud Ben Hassine and Saikat Bhadra <saikat.bhadra@gmail.com>) Default Job < 1 sec
Successful HibernateCursorItemReaderNamedQueryIntegrationTests testMultipleRestarts History
Failing since build #385 (Changes by Mahmoud Ben Hassine and Saikat Bhadra <saikat.bhadra@gmail.com>) Default Job < 1 sec
Successful HibernateCursorItemReaderNamedQueryIntegrationTests testRestart History
Failing since build #385 (Changes by Mahmoud Ben Hassine and Saikat Bhadra <saikat.bhadra@gmail.com>) Default Job < 1 sec
Successful HibernateCursorItemReaderParametersIntegrationTests testInvalidRestore History
Failing since build #385 (Changes by Mahmoud Ben Hassine and Saikat Bhadra <saikat.bhadra@gmail.com>) Default Job < 1 sec
Successful HibernateCursorItemReaderParametersIntegrationTests testRollbackAndRestart History
Failing since build #385 (Changes by Mahmoud Ben Hassine and Saikat Bhadra <saikat.bhadra@gmail.com>) Default Job < 1 sec
Successful HibernateCursorItemReaderParametersIntegrationTests testRestartOnSecondPage History
Failing since build #385 (Changes by Mahmoud Ben Hassine and Saikat Bhadra <saikat.bhadra@gmail.com>) Default Job < 1 sec
Successful HibernateCursorItemReaderParametersIntegrationTests testMultipleRestarts History
Failing since build #385 (Changes by Mahmoud Ben Hassine and Saikat Bhadra <saikat.bhadra@gmail.com>) Default Job < 1 sec
Successful HibernateCursorItemReaderParametersIntegrationTests testRestoreFromEmptyData History
Failing since build #385 (Changes by Mahmoud Ben Hassine and Saikat Bhadra <saikat.bhadra@gmail.com>) Default Job < 1 sec
Successful HibernateCursorItemReaderParametersIntegrationTests testRestart History
Failing since build #385 (Changes by Mahmoud Ben Hassine and Saikat Bhadra <saikat.bhadra@gmail.com>) Default Job < 1 sec
Successful HibernateCursorItemReaderParametersIntegrationTests testRollbackOnFirstChunkAndRestart History
Failing since build #385 (Changes by Mahmoud Ben Hassine and Saikat Bhadra <saikat.bhadra@gmail.com>) Default Job < 1 sec
Successful HibernateCursorItemReaderParametersIntegrationTests testNormalProcessing History
Failing since build #385 (Changes by Mahmoud Ben Hassine and Saikat Bhadra <saikat.bhadra@gmail.com>) Default Job < 1 sec
Successful HibernateCursorProjectionItemReaderIntegrationTests testMultipleItemsInProjection History
Failing since build #385 (Changes by Mahmoud Ben Hassine and Saikat Bhadra <saikat.bhadra@gmail.com>) Default Job < 1 sec
Successful HibernateCursorProjectionItemReaderIntegrationTests testSingleItemInProjectionWithArrayType History
Failing since build #385 (Changes by Mahmoud Ben Hassine and Saikat Bhadra <saikat.bhadra@gmail.com>) Default Job < 1 sec
Successful HibernateCursorProjectionItemReaderIntegrationTests testSingleItemInProjection History
Failing since build #385 (Changes by Mahmoud Ben Hassine and Saikat Bhadra <saikat.bhadra@gmail.com>) Default Job < 1 sec
Successful HibernateItemReaderHelperTests testOneSessionForAllPages History
Failing since build #385 (Changes by Mahmoud Ben Hassine and Saikat Bhadra <saikat.bhadra@gmail.com>) Default Job < 1 sec
Successful HibernateItemReaderHelperTests testSessionReset History
Failing since build #385 (Changes by Mahmoud Ben Hassine and Saikat Bhadra <saikat.bhadra@gmail.com>) Default Job < 1 sec
Successful HibernatePagingItemReaderIntegrationTests testMultipleRestarts History
Failing since build #385 (Changes by Mahmoud Ben Hassine and Saikat Bhadra <saikat.bhadra@gmail.com>) Default Job < 1 sec
Successful HibernatePagingItemReaderIntegrationTests testRestart History
Failing since build #385 (Changes by Mahmoud Ben Hassine and Saikat Bhadra <saikat.bhadra@gmail.com>) Default Job < 1 sec
Successful HibernatePagingItemReaderIntegrationTests testRollbackOnFirstChunkAndRestart History
Failing since build #385 (Changes by Mahmoud Ben Hassine and Saikat Bhadra <saikat.bhadra@gmail.com>) Default Job < 1 sec
Successful HibernatePagingItemReaderIntegrationTests testRestoreFromEmptyData History
Failing since build #385 (Changes by Mahmoud Ben Hassine and Saikat Bhadra <saikat.bhadra@gmail.com>) Default Job < 1 sec
Successful HibernatePagingItemReaderIntegrationTests testRollbackAndRestart History
Failing since build #385 (Changes by Mahmoud Ben Hassine and Saikat Bhadra <saikat.bhadra@gmail.com>) Default Job < 1 sec
Successful HibernatePagingItemReaderIntegrationTests testRestartOnSecondPage History
Failing since build #385 (Changes by Mahmoud Ben Hassine and Saikat Bhadra <saikat.bhadra@gmail.com>) Default Job < 1 sec
Successful HibernatePagingItemReaderIntegrationTests testNormalProcessing History
Failing since build #385 (Changes by Mahmoud Ben Hassine and Saikat Bhadra <saikat.bhadra@gmail.com>) Default Job < 1 sec
Successful HibernatePagingItemReaderIntegrationTests testInvalidRestore History
Failing since build #385 (Changes by Mahmoud Ben Hassine and Saikat Bhadra <saikat.bhadra@gmail.com>) Default Job < 1 sec
Successful HibernateCursorItemReaderBuilderTests testConfiguration History
Failing since build #385 (Changes by Mahmoud Ben Hassine and Saikat Bhadra <saikat.bhadra@gmail.com>) Default Job < 1 sec
Successful HibernatePagingItemReaderBuilderTests testConfigurationNoSaveState History
Failing since build #385 (Changes by Mahmoud Ben Hassine and Saikat Bhadra <saikat.bhadra@gmail.com>) Default Job < 1 sec

JIRA issues

IssueDescriptionStatus
Unknown Issue TypeBATCH-2774Could not obtain issue details from JIRA