Build to verify Spring IO compatibility.

Build: #389 failed Changes by Spring Buildmaster

Build result summary

Details

Completed
Duration
1 minute
Labels
None
Agent
bamboo-14.af.pivotal.io
Revision
4de1a9056ed6adf68a98ffde0f0759d385612381 4de1a9056ed6adf68a98ffde0f0759d385612381
Total tests
1903
Failing since
#385 (Changes by Mahmoud Ben Hassine and Saikat Bhadra <saikat.bhadra@gmail.com>)

Responsible

Code commits

Author Commit Message Commit date
Spring Buildmaster Spring Buildmaster 4de1a9056ed6adf68a98ffde0f0759d385612381 4de1a9056ed6adf68a98ffde0f0759d385612381 [artifactory-release] Next development version
Spring Buildmaster Spring Buildmaster 691ea2deffbd80989b299fb142608a10c33525f0 691ea2deffbd80989b299fb142608a10c33525f0 [artifactory-release] Release version 4.2.0.M1

Tests

New test failures 1
Status Test View job Duration
Collapse Failed DecisionStepTests testDecisionAfterSplit History
Default Job < 1 sec
java.lang.AssertionError: java.lang.AssertionError: expected:<COMPLETED> but was:<FAILED>
java.lang.AssertionError: expected:<COMPLETED> but was:<FAILED>
	at org.junit.Assert.fail(Assert.java:88)
	at org.junit.Assert.failNotEquals(Assert.java:834)
	at org.junit.Assert.assertEquals(Assert.java:118)
	at org.junit.Assert.assertEquals(Assert.java:144)
	at org.springframework.batch.core.jsr.step.DecisionStepTests.testDecisionAfterSplit(DecisionStepTests.java:111)
	at sun.reflect.NativeMethodAccessorImpl.invoke0(Native Method)
(45 more lines...)