Run against the latest Java Version

Build result summary

Details

Completed
Duration
4 minutes
Labels
None
Agent
bamboo-19.af.pivotal.io
Revision
f26165e764c1e4b25a3778eafa9783bea7d73693 f26165e764c1e4b25a3778eafa9783bea7d73693
Total tests
3781
Fixed in
#132 (Changes by Jay Bryant)

Tests

Responsible

Code commits

Author Commit Message Commit date
Mahmoud Ben Hassine Mahmoud Ben Hassine f26165e764c1e4b25a3778eafa9783bea7d73693 f26165e764c1e4b25a3778eafa9783bea7d73693 Polish bd53168ddb613aa5a5f8bc550f20a828ce3cf17d
David Turanski <dturanski@pivotal.io> David Turanski <dturanski@pivotal.io> bd53168ddb613aa5a5f8bc550f20a828ce3cf17d bd53168ddb613aa5a5f8bc550f20a828ce3cf17d Implement AvroItemReader and AvroItemWriter
Resolves BATCH-2833

Tests

New test failures 1
Status Test View job Duration
Collapse Failed JsrSplitParsingTests test History
Default Job < 1 sec
java.lang.AssertionError: java.lang.AssertionError: expected:<COMPLETED> but was:<FAILED>
java.lang.AssertionError: expected:<COMPLETED> but was:<FAILED>
	at org.junit.Assert.fail(Assert.java:88)
	at org.junit.Assert.failNotEquals(Assert.java:834)
	at org.junit.Assert.assertEquals(Assert.java:118)
	at org.junit.Assert.assertEquals(Assert.java:144)
	at org.springframework.batch.core.jsr.configuration.xml.JsrSplitParsingTests.test(JsrSplitParsingTests.java:49)
	at java.base/jdk.internal.reflect.NativeMethodAccessorImpl.invoke0(Native Method)
(46 more lines...)

Jira issues

IssueDescriptionStatus
Unknown Issue TypeBATCH-2833Could not obtain issue details from Jira