Run against the latest Java Version

Build result summary

Details

Completed
Duration
21 minutes
Labels
None
Agent
bamboo-18.af.pivotal.io
Revision
fba1c3adaba603aafed1b08ddf51c7f6d6e9eee6 fba1c3adaba603aafed1b08ddf51c7f6d6e9eee6
Failing since
#173 (Changes by Drummond Dawson <drumonii@users.noreply.github.com>)
Fixed in
#177 (Rebuilt by Mahmoud Ben Hassine)
No failed test found. A possible compilation error occurred.

Responsible

This build has been failing since #173
No one has taken responsibility

Comments on Default Job

  1. Anonymous user

    Detected hung build state. Attempting to generate stack trace and terminate spawned sub-processes.

Code commits

Author Commit Message Commit date
Mahmoud Ben Hassine Mahmoud Ben Hassine fba1c3adaba603aafed1b08ddf51c7f6d6e9eee6 fba1c3adaba603aafed1b08ddf51c7f6d6e9eee6 Polish 62a2e65e204287196719451d1965c4fa0e2cce4a
Add null check for delimiter
Drummond Dawson <drumonii@users.noreply.github.com> Drummond Dawson <drumonii@users.noreply.github.com> 62a2e65e204287196719451d1965c4fa0e2cce4a 62a2e65e204287196719451d1965c4fa0e2cce4a Support empty delimiter in DelimitedBuilder of FlatFileItemWriterBuilder
Previously, if supplying an empty delimiter, to the delimited().delimiter() of DelimitedBuilder from the parent FlatFileItemWriterBuilder, it would be ignored and instead use the default delimiter ",".

Resolves BATCH-2844

Jira issues

IssueDescriptionStatus
Unknown Issue TypeBATCH-2844Could not obtain issue details from Jira

Error summary for Default Job

The job generated some errors, drill down into the full build log for more details.

Could not find test result reports in the /opt/bamboo-home/xml-data/build-dir/BATCH-JL-JOB1 directory.
        at java.base/java.util.concurrent.ThreadPoolExecutor$Worker.run(ThreadPoolExecutor.java:628)
        at org.gradle.internal.concurrent.ThreadFactoryImpl$ManagedThreadRunnable.run(ThreadFactoryImpl.java:55)
        at java.base/java.lang.Thread.run(Thread.java:830)
Exception in thread "main" java.lang.reflect.InvocationTargetException
        at java.base/jdk.internal.reflect.NativeMethodAccessorImpl.invoke0(Native Method)
        at java.base/jdk.internal.reflect.NativeMethodAccessorImpl.invoke(NativeMethodAccessorImpl.java:62)
        at java.base/jdk.internal.reflect.DelegatingMethodAccessorImpl.invoke(DelegatingMethodAccessorImpl.java:43)
        at java.base/java.lang.reflect.Method.invoke(Method.java:567)
        at java.instrument/sun.instrument.InstrumentationImpl.loadClassAndStartAgent(InstrumentationImpl.java:513)
        at java.instrument/sun.instrument.InstrumentationImpl.loadClassAndCallPremain(InstrumentationImpl.java:525)
Caused by: java.lang.RuntimeException: Class java/lang/UnknownError could not be instrumented.
        at org.jacoco.agent.rt.internal_28bab1d.core.runtime.ModifiedSystemClassRuntime.createFor(ModifiedSystemClassRuntime.java:140)
        at org.jacoco.agent.rt.internal_28bab1d.core.runtime.ModifiedSystemClassRuntime.createFor(ModifiedSystemClassRuntime.java:101)
        at org.jacoco.agent.rt.internal_28bab1d.PreMain.createRuntime(PreMain.java:55)
        at org.jacoco.agent.rt.internal_28bab1d.PreMain.premain(PreMain.java:47)
        ... 6 more
Caused by: java.lang.NoSuchFieldException: $jacocoAccess
        at java.base/java.lang.Class.getField(Class.java:2000)
        at org.jacoco.agent.rt.internal_28bab1d.core.runtime.ModifiedSystemClassRuntime.createFor(ModifiedSystemClassRuntime.java:138)
        ... 9 more
*** java.lang.instrument ASSERTION FAILED ***: "result" with message agent load/premain call failed at JPLISAgent.c line: 422
Process 'Gradle Test Executor 4' finished with non-zero exit value 134
org.gradle.process.internal.ExecException: Process 'Gradle Test Executor 4' finished with non-zero exit value 134
        at org.gradle.process.internal.DefaultExecHandle$ExecResultImpl.assertNormalExitValue(DefaultExecHandle.java:395)
        at org.gradle.process.internal.worker.DefaultWorkerProcess.onProcessStop(DefaultWorkerProcess.java:138)
        at org.gradle.process.internal.worker.DefaultWorkerProcess.access$000(DefaultWorkerProcess.java:41)
        at org.gradle.process.internal.worker.DefaultWorkerProcess$1.executionFinished(DefaultWorkerProcess.java:91)
        at java.base/jdk.internal.reflect.NativeMethodAccessorImpl.invoke0(Native Method)
        at java.base/jdk.internal.reflect.NativeMethodAccessorImpl.invoke(NativeMethodAccessorImpl.java:62)
        at java.base/jdk.internal.reflect.DelegatingMethodAccessorImpl.invoke(DelegatingMethodAccessorImpl.java:43)
        at java.base/java.lang.reflect.Method.invoke(Method.java:567)
        at org.gradle.internal.dispatch.ReflectionDispatch.dispatch(ReflectionDispatch.java:35)
        at org.gradle.internal.dispatch.ReflectionDispatch.dispatch(ReflectionDispatch.java:24)
        at org.gradle.internal.event.AbstractBroadcastDispatch.dispatch(AbstractBroadcastDispatch.java:42)
        at org.gradle.internal.event.BroadcastDispatch$SingletonDispatch.dispatch(BroadcastDispatch.java:230)
        at org.gradle.internal.event.BroadcastDispatch$SingletonDispatch.dispatch(BroadcastDispatch.java:149)
        at org.gradle.internal.event.ListenerBroadcast.dispatch(ListenerBroadcast.java:140)
        at org.gradle.internal.event.ListenerBroadcast.dispatch(ListenerBroadcast.java:37)
        at org.gradle.internal.dispatch.ProxyDispatchAdapter$DispatchingInvocationHandler.invoke(ProxyDispatchAdapter.java:93)
        at com.sun.proxy.$Proxy55.executionFinished(Unknown Source)
        at org.gradle.process.internal.DefaultExecHandle.setEndStateInfo(DefaultExecHandle.java:212)
        at org.gradle.process.internal.DefaultExecHandle.finished(DefaultExecHandle.java:340)
        at org.gradle.process.internal.ExecHandleRunner.completed(ExecHandleRunner.java:102)
        at org.gradle.process.internal.ExecHandleRunner.run(ExecHandleRunner.java:82)
        at org.gradle.internal.operations.CurrentBuildOperationPreservingRunnable.run(CurrentBuildOperationPreservingRunnable.java:42)
        at org.gradle.internal.concurrent.ExecutorPolicy$CatchAndRecordFailures.onExecute(ExecutorPolicy.java:63)
        at org.gradle.internal.concurrent.ManagedExecutorImpl$1.run(ManagedExecutorImpl.java:46)
        at java.base/java.util.concurrent.ThreadPoolExecutor.runWorker(ThreadPoolExecutor.java:1128)
        at java.base/java.util.concurrent.ThreadPoolExecutor$Worker.run(ThreadPoolExecutor.java:628)
        at org.gradle.internal.concurrent.ThreadFactoryImpl$ManagedThreadRunnable.run(ThreadFactoryImpl.java:55)
        at java.base/java.lang.Thread.run(Thread.java:830)
Exception in thread "main" java.lang.reflect.InvocationTargetException
        at java.base/jdk.internal.reflect.NativeMethodAccessorImpl.invoke0(Native Method)
        at java.base/jdk.internal.reflect.NativeMethodAccessorImpl.invoke(NativeMethodAccessorImpl.java:62)
        at java.base/jdk.internal.reflect.DelegatingMethodAccessorImpl.invoke(DelegatingMethodAccessorImpl.java:43)
        at java.base/java.lang.reflect.Method.invoke(Method.java:567)
        at java.instrument/sun.instrument.InstrumentationImpl.loadClassAndStartAgent(InstrumentationImpl.java:513)
        at java.instrument/sun.instrument.InstrumentationImpl.loadClassAndCallPremain(InstrumentationImpl.java:525)
Caused by: java.lang.RuntimeException: Class java/lang/UnknownError could not be instrumented.
        at org.jacoco.agent.rt.internal_28bab1d.core.runtime.ModifiedSystemClassRuntime.createFor(ModifiedSystemClassRuntime.java:140)
        at org.jacoco.agent.rt.internal_28bab1d.core.runtime.ModifiedSystemClassRuntime.createFor(ModifiedSystemClassRuntime.java:101)
        at org.jacoco.agent.rt.internal_28bab1d.PreMain.createRuntime(PreMain.java:55)
        at org.jacoco.agent.rt.internal_28bab1d.PreMain.premain(PreMain.java:47)
        ... 6 more
Caused by: java.lang.NoSuchFieldException: $jacocoAccess
        at java.base/java.lang.Class.getField(Class.java:2000)
        at org.jacoco.agent.rt.internal_28bab1d.core.runtime.ModifiedSystemClassRuntime.createFor(ModifiedSystemClassRuntime.java:138)
        ... 9 more
*** java.lang.instrument ASSERTION FAILED ***: "result" with message agent load/premain call failed at JPLISAgent.c line: 422
Process 'Gradle Test Executor 5' finished with non-zero exit value 134
org.gradle.process.internal.ExecException: Process 'Gradle Test Executor 5' finished with non-zero exit value 134
        at org.gradle.process.internal.DefaultExecHandle$ExecResultImpl.assertNormalExitValue(DefaultExecHandle.java:395)
        at org.gradle.process.internal.worker.DefaultWorkerProcess.onProcessStop(DefaultWorkerProcess.java:138)
        at org.gradle.process.internal.worker.DefaultWorkerProcess.access$000(DefaultWorkerProcess.java:41)
        at org.gradle.process.internal.worker.DefaultWorkerProcess$1.executionFinished(DefaultWorkerProcess.java:91)
        at java.base/jdk.internal.reflect.NativeMethodAccessorImpl.invoke0(Native Method)
        at java.base/jdk.internal.reflect.NativeMethodAccessorImpl.invoke(NativeMethodAccessorImpl.java:62)
        at java.base/jdk.internal.reflect.DelegatingMethodAccessorImpl.invoke(DelegatingMethodAccessorImpl.java:43)
        at java.base/java.lang.reflect.Method.invoke(Method.java:567)
        at org.gradle.internal.dispatch.ReflectionDispatch.dispatch(ReflectionDispatch.java:35)
        at org.gradle.internal.dispatch.ReflectionDispatch.dispatch(ReflectionDispatch.java:24)
        at org.gradle.internal.event.AbstractBroadcastDispatch.dispatch(AbstractBroadcastDispatch.java:42)
        at org.gradle.internal.event.BroadcastDispatch$SingletonDispatch.dispatch(BroadcastDispatch.java:230)
        at org.gradle.internal.event.BroadcastDispatch$SingletonDispatch.dispatch(BroadcastDispatch.java:149)
        at org.gradle.internal.event.ListenerBroadcast.dispatch(ListenerBroadcast.java:140)
        at org.gradle.internal.event.ListenerBroadcast.dispatch(ListenerBroadcast.java:37)
        at org.gradle.internal.dispatch.ProxyDispatchAdapter$DispatchingInvocationHandler.invoke(ProxyDispatchAdapter.java:93)
        at com.sun.proxy.$Proxy55.executionFinished(Unknown Source)
        at org.gradle.process.internal.DefaultExecHandle.setEndStateInfo(DefaultExecHandle.java:212)
        at org.gradle.process.internal.DefaultExecHandle.finished(DefaultExecHandle.java:340)
        at org.gradle.process.internal.ExecHandleRunner.completed(ExecHandleRunner.java:102)
        at org.gradle.process.internal.ExecHandleRunner.run(ExecHandleRunner.java:82)
        at org.gradle.internal.operations.CurrentBuildOperationPreservingRunnable.run(CurrentBuildOperationPreservingRunnable.java:42)
        at org.gradle.internal.concurrent.ExecutorPolicy$CatchAndRecordFailures.onExecute(ExecutorPolicy.java:63)
        at org.gradle.internal.concurrent.ManagedExecutorImpl$1.run(ManagedExecutorImpl.java:46)
        at java.base/java.util.concurrent.ThreadPoolExecutor.runWorker(ThreadPoolExecutor.java:1128)
        at java.base/java.util.concurrent.ThreadPoolExecutor$Worker.run(ThreadPoolExecutor.java:628)
        at org.gradle.internal.concurrent.ThreadFactoryImpl$ManagedThreadRunnable.run(ThreadFactoryImpl.java:55)
        at java.base/java.lang.Thread.run(Thread.java:830)
Force Stop build feature is enabled for current plan. Either Bamboo has detected the build has hung or it has been manually stopped.