Run against the latest Java Version

Build: #192 failed Changes by Michael Minella

Build result summary

Details

Completed
Duration
1 minute
Labels
None
Agent
bamboo-14.af.pivotal.io
Revision
d41cd45f901c2699f3d0f5e6b7fe1931787259ff d41cd45f901c2699f3d0f5e6b7fe1931787259ff
Total tests
1914
Failing since
#191 (Changes by BenjaminHetzJelli <benjamin@jelli.com>)
Fixed in
#193 (Changes by Mahmoud Ben Hassine)

Tests

Responsible

This build has been failing since #191
No one has taken responsibility

Code commits

Author Commit Message Commit date
Michael Minella Michael Minella d41cd45f901c2699f3d0f5e6b7fe1931787259ff d41cd45f901c2699f3d0f5e6b7fe1931787259ff Updated step.adoc to correctly configure a split
Michael Minella Michael Minella b83c81e680e38f6504c1dd8600724e2d221a6acb b83c81e680e38f6504c1dd8600724e2d221a6acb Updated email addresses from Pivotal to VMware

Tests

New test failures 1
Status Test View job Duration
Collapse Failed JsrSplitParsingTests test History
Default Job < 1 sec
java.lang.AssertionError: java.lang.AssertionError: expected:<COMPLETED> but was:<FAILED>
java.lang.AssertionError: expected:<COMPLETED> but was:<FAILED>
	at org.junit.Assert.fail(Assert.java:89)
	at org.junit.Assert.failNotEquals(Assert.java:835)
	at org.junit.Assert.assertEquals(Assert.java:120)
	at org.junit.Assert.assertEquals(Assert.java:146)
	at org.springframework.batch.core.jsr.configuration.xml.JsrSplitParsingTests.test(JsrSplitParsingTests.java:49)
	at java.base/jdk.internal.reflect.NativeMethodAccessorImpl.invoke0(Native Method)
(48 more lines...)