Run against the latest Java Version

Build: #289 failed Rebuilt by Mahmoud Ben Hassine

Build result summary

Details

Completed
Duration
2 minutes
Labels
None
Agent
bamboo-17.af.pivotal.io
Revision
24aba13c2411cf943f63b60983eb9ef47b887e5e 24aba13c2411cf943f63b60983eb9ef47b887e5e
Total tests
1926
Fixed in
#290 (Rebuilt by Mahmoud Ben Hassine)
Number of retries
2

Tests

Responsible

No one has taken responsibility for this failure

Code commits

Author Commit Message Commit date
Mahmoud Ben Hassine <mbenhassine@vmware.com> Mahmoud Ben Hassine <mbenhassine@vmware.com> 24aba13c2411cf943f63b60983eb9ef47b887e5e 24aba13c2411cf943f63b60983eb9ef47b887e5e Downgrade activemq version to 5.15.13
5.16 seems to introduce a regression
that makes jms related tests to fail.

Tests

New test failures 1
Status Test View job Duration
Collapse Failed DecisionStepTests testDecisionAfterSplit History
Default Job < 1 sec
java.lang.AssertionError: java.lang.AssertionError: Received a FAILED because of org.springframework.batch.core.JobExecutionException: Flow execution ended unexpectedly
	at org.springframework.batch.core.jsr.job.flow.JsrFlowJob.doExecute(JsrFlowJob.java:88)
	at org.springframework.batch.core.job.AbstractJob.execute(AbstractJob.java:320)
	at org.springframework.batch.core.jsr.launch.JsrJobOperator$2.run(JsrJobOperator.java:674)
	at java.base/java.lang.Thread.run(Thread.java:832)
Caused by: org.springframework.batch.core.job.flow.FlowExecutionException: Ended flow=flow2.step1 at state=flow2.step1.flow2.step1 with exception
	at org.springframework.batch.core.job.flow.support.SimpleFlow.resume(SimpleFlow.java:178)
	at org.springframework.batch.core.job.flow.support.SimpleFlow.start(SimpleFlow.java:144)
(93 more lines...)