Run against the latest Java Version

Build result summary

Details

Completed
Duration
4 minutes
Labels
None
Agent
bamboo-06.af.pivotal.io
Revision
d8fc58338d3b059b67b5f777adc132d2564d7402 d8fc58338d3b059b67b5f777adc132d2564d7402
Total tests
3717
Failing since
#95 (Changes by Spring Operator <spring-operator@users.noreply.github.com>)

Responsible

This build has been failing since #95
No one has taken responsibility

Code commits

Author Commit Message Commit date
Spring Operator <spring-operator@users.noreply.github.com> Spring Operator <spring-operator@users.noreply.github.com> d8fc58338d3b059b67b5f777adc132d2564d7402 d8fc58338d3b059b67b5f777adc132d2564d7402 URL Cleanup
This commit updates URLs to prefer the https protocol. Redirects are not followed to avoid accidentally expanding intentionally shortened URLs (i.e. if using a URL shortener).

# Fixed URLs

## Fixed Success
These URLs were switched to an https URL with a 2xx status. While the status was successful, your review is still recommended.

* [ ] http://www.apache.org/licenses/ with 2 occurrences migrated to:
  https://www.apache.org/licenses/ ([https](https://www.apache.org/licenses/) result 200).
* [ ] http://www.apache.org/licenses/LICENSE-2.0 with 1796 occurrences migrated to:
  https://www.apache.org/licenses/LICENSE-2.0 ([https](https://www.apache.org/licenses/LICENSE-2.0) result 200).

Tests

Existing test failures 14
Status Test Failing since View job Duration
java.lang.IllegalStateException: java.lang.IllegalStateException: Failed to load ApplicationContext
java.lang.IllegalStateException: Failed to load ApplicationContext
	at org.springframework.test.context.cache.DefaultCacheAwareContextLoaderDelegate.loadContext(DefaultCacheAwareContextLoaderDelegate.java:125)
	at org.springframework.test.context.support.DefaultTestContext.getApplicationContext(DefaultTestContext.java:108)
	at org.springframework.test.context.support.DependencyInjectionTestExecutionListener.injectDependencies(DependencyInjectionTestExecutionListener.java:118)
	at org.springframework.test.context.support.DependencyInjectionTestExecutionListener.prepareTestInstance(DependencyInjectionTestExecutionListener.java:83)
	at org.springframework.test.context.TestContextManager.prepareTestInstance(TestContextManager.java:244)
	at org.springframework.test.context.junit4.SpringJUnit4ClassRunner.createTest(SpringJUnit4ClassRunner.java:227)
(82 more lines...)
java.lang.IllegalStateException: java.lang.IllegalStateException: Failed to load ApplicationContext
java.lang.IllegalStateException: Failed to load ApplicationContext
	at org.springframework.test.context.cache.DefaultCacheAwareContextLoaderDelegate.loadContext(DefaultCacheAwareContextLoaderDelegate.java:125)
	at org.springframework.test.context.support.DefaultTestContext.getApplicationContext(DefaultTestContext.java:108)
	at org.springframework.test.context.support.DependencyInjectionTestExecutionListener.injectDependencies(DependencyInjectionTestExecutionListener.java:118)
	at org.springframework.test.context.support.DependencyInjectionTestExecutionListener.prepareTestInstance(DependencyInjectionTestExecutionListener.java:83)
	at org.springframework.test.context.TestContextManager.prepareTestInstance(TestContextManager.java:244)
	at org.springframework.test.context.junit4.SpringJUnit4ClassRunner.createTest(SpringJUnit4ClassRunner.java:227)
(82 more lines...)
java.lang.IllegalStateException: java.lang.IllegalStateException: Failed to load ApplicationContext
java.lang.IllegalStateException: Failed to load ApplicationContext
	at org.springframework.test.context.cache.DefaultCacheAwareContextLoaderDelegate.loadContext(DefaultCacheAwareContextLoaderDelegate.java:125)
	at org.springframework.test.context.support.DefaultTestContext.getApplicationContext(DefaultTestContext.java:108)
	at org.springframework.test.context.support.DependencyInjectionTestExecutionListener.injectDependencies(DependencyInjectionTestExecutionListener.java:118)
	at org.springframework.test.context.support.DependencyInjectionTestExecutionListener.prepareTestInstance(DependencyInjectionTestExecutionListener.java:83)
	at org.springframework.test.context.TestContextManager.prepareTestInstance(TestContextManager.java:244)
	at org.springframework.test.context.junit4.SpringJUnit4ClassRunner.createTest(SpringJUnit4ClassRunner.java:227)
(82 more lines...)
java.lang.IllegalStateException: java.lang.IllegalStateException: Failed to load ApplicationContext
java.lang.IllegalStateException: Failed to load ApplicationContext
	at org.springframework.test.context.cache.DefaultCacheAwareContextLoaderDelegate.loadContext(DefaultCacheAwareContextLoaderDelegate.java:125)
	at org.springframework.test.context.support.DefaultTestContext.getApplicationContext(DefaultTestContext.java:108)
	at org.springframework.test.context.support.DependencyInjectionTestExecutionListener.injectDependencies(DependencyInjectionTestExecutionListener.java:118)
	at org.springframework.test.context.support.DependencyInjectionTestExecutionListener.prepareTestInstance(DependencyInjectionTestExecutionListener.java:83)
	at org.springframework.test.context.TestContextManager.prepareTestInstance(TestContextManager.java:244)
	at org.springframework.test.context.junit4.SpringJUnit4ClassRunner.createTest(SpringJUnit4ClassRunner.java:227)
(82 more lines...)
java.lang.IllegalStateException: java.lang.IllegalStateException: Failed to load ApplicationContext
java.lang.IllegalStateException: Failed to load ApplicationContext
	at org.springframework.test.context.cache.DefaultCacheAwareContextLoaderDelegate.loadContext(DefaultCacheAwareContextLoaderDelegate.java:125)
	at org.springframework.test.context.support.DefaultTestContext.getApplicationContext(DefaultTestContext.java:108)
	at org.springframework.test.context.support.DependencyInjectionTestExecutionListener.injectDependencies(DependencyInjectionTestExecutionListener.java:118)
	at org.springframework.test.context.support.DependencyInjectionTestExecutionListener.prepareTestInstance(DependencyInjectionTestExecutionListener.java:83)
	at org.springframework.test.context.TestContextManager.prepareTestInstance(TestContextManager.java:244)
	at org.springframework.test.context.junit4.SpringJUnit4ClassRunner.createTest(SpringJUnit4ClassRunner.java:227)
(82 more lines...)
org.springframework.beans.factory.xml.XmlBeanDefinitionStoreException: org.springframework.beans.factory.xml.XmlBeanDefinitionStoreException: Line 10 in XML document from class path resource [org/springframework/batch/core/jsr/configuration/xml/default-split-task-executor-context.xml] is invalid; nested exception is org.xml.sax.SAXParseException; lineNumber: 10; columnNumber: 77; cvc-complex-type.2.4.c: The matching wildcard is strict, but no declaration can be found for element 'job'.
org.springframework.beans.factory.xml.XmlBeanDefinitionStoreException: Line 10 in XML document from class path resource [org/springframework/batch/core/jsr/configuration/xml/default-split-task-executor-context.xml] is invalid; nested exception is org.xml.sax.SAXParseException; lineNumber: 10; columnNumber: 77; cvc-complex-type.2.4.c: The matching wildcard is strict, but no declaration can be found for element 'job'.
	at org.springframework.beans.factory.xml.XmlBeanDefinitionReader.doLoadBeanDefinitions(XmlBeanDefinitionReader.java:404)
	at org.springframework.beans.factory.xml.XmlBeanDefinitionReader.loadBeanDefinitions(XmlBeanDefinitionReader.java:336)
	at org.springframework.beans.factory.xml.XmlBeanDefinitionReader.loadBeanDefinitions(XmlBeanDefinitionReader.java:304)
	at org.springframework.beans.factory.support.AbstractBeanDefinitionReader.loadBeanDefinitions(AbstractBeanDefinitionReader.java:188)
	at org.springframework.beans.factory.support.AbstractBeanDefinitionReader.loadBeanDefinitions(AbstractBeanDefinitionReader.java:224)
	at org.springframework.beans.factory.support.AbstractBeanDefinitionReader.loadBeanDefinitions(AbstractBeanDefinitionReader.java:195)
(80 more lines...)
org.springframework.beans.factory.xml.XmlBeanDefinitionStoreException: org.springframework.beans.factory.xml.XmlBeanDefinitionStoreException: Line 10 in XML document from class path resource [org/springframework/batch/core/jsr/configuration/xml/user-specified-split-task-executor-context.xml] is invalid; nested exception is org.xml.sax.SAXParseException; lineNumber: 10; columnNumber: 77; cvc-complex-type.2.4.c: The matching wildcard is strict, but no declaration can be found for element 'job'.
org.springframework.beans.factory.xml.XmlBeanDefinitionStoreException: Line 10 in XML document from class path resource [org/springframework/batch/core/jsr/configuration/xml/user-specified-split-task-executor-context.xml] is invalid; nested exception is org.xml.sax.SAXParseException; lineNumber: 10; columnNumber: 77; cvc-complex-type.2.4.c: The matching wildcard is strict, but no declaration can be found for element 'job'.
	at org.springframework.beans.factory.xml.XmlBeanDefinitionReader.doLoadBeanDefinitions(XmlBeanDefinitionReader.java:404)
	at org.springframework.beans.factory.xml.XmlBeanDefinitionReader.loadBeanDefinitions(XmlBeanDefinitionReader.java:336)
	at org.springframework.beans.factory.xml.XmlBeanDefinitionReader.loadBeanDefinitions(XmlBeanDefinitionReader.java:304)
	at org.springframework.beans.factory.support.AbstractBeanDefinitionReader.loadBeanDefinitions(AbstractBeanDefinitionReader.java:188)
	at org.springframework.beans.factory.support.AbstractBeanDefinitionReader.loadBeanDefinitions(AbstractBeanDefinitionReader.java:224)
	at org.springframework.beans.factory.support.AbstractBeanDefinitionReader.loadBeanDefinitions(AbstractBeanDefinitionReader.java:195)
(80 more lines...)
org.springframework.beans.factory.xml.XmlBeanDefinitionStoreException: org.springframework.beans.factory.xml.XmlBeanDefinitionStoreException: Line 8 in XML document from class path resource [org/springframework/batch/core/jsr/configuration/xml/invalid-split-context.xml] is invalid; nested exception is org.xml.sax.SAXParseException; lineNumber: 8; columnNumber: 77; cvc-complex-type.2.4.c: The matching wildcard is strict, but no declaration can be found for element 'job'.
org.springframework.beans.factory.xml.XmlBeanDefinitionStoreException: Line 8 in XML document from class path resource [org/springframework/batch/core/jsr/configuration/xml/invalid-split-context.xml] is invalid; nested exception is org.xml.sax.SAXParseException; lineNumber: 8; columnNumber: 77; cvc-complex-type.2.4.c: The matching wildcard is strict, but no declaration can be found for element 'job'.
	at org.springframework.beans.factory.xml.XmlBeanDefinitionReader.doLoadBeanDefinitions(XmlBeanDefinitionReader.java:404)
	at org.springframework.beans.factory.xml.XmlBeanDefinitionReader.loadBeanDefinitions(XmlBeanDefinitionReader.java:336)
	at org.springframework.beans.factory.xml.XmlBeanDefinitionReader.loadBeanDefinitions(XmlBeanDefinitionReader.java:304)
	at org.springframework.beans.factory.support.AbstractBeanDefinitionReader.loadBeanDefinitions(AbstractBeanDefinitionReader.java:188)
	at org.springframework.beans.factory.support.AbstractBeanDefinitionReader.loadBeanDefinitions(AbstractBeanDefinitionReader.java:224)
	at org.springframework.beans.factory.support.AbstractBeanDefinitionReader.loadBeanDefinitions(AbstractBeanDefinitionReader.java:195)
(80 more lines...)
org.springframework.beans.factory.parsing.BeanDefinitionParsingException: org.springframework.beans.factory.parsing.BeanDefinitionParsingException: Configuration problem: Failed to import bean definitions from relative location [RetryListenerTestBase-context.xml]
Offending resource: class path resource [org/springframework/batch/core/jsr/configuration/xml/RetryReadListenerExhausted.xml]; nested exception is org.springframework.beans.factory.xml.XmlBeanDefinitionStoreException: Line 6 in XML document from class path resource [org/springframework/batch/core/jsr/configuration/xml/RetryListenerTestBase-context.xml] is invalid; nested exception is org.xml.sax.SAXParseException; lineNumber: 6; columnNumber: 77; cvc-complex-type.2.4.c: The matching wildcard is strict, but no declaration can be found for element 'job'.
org.springframework.beans.factory.parsing.BeanDefinitionParsingException: Configuration problem: Failed to import bean definitions from relative location [RetryListenerTestBase-context.xml]
Offending resource: class path resource [org/springframework/batch/core/jsr/configuration/xml/RetryReadListenerExhausted.xml]; nested exception is org.springframework.beans.factory.xml.XmlBeanDefinitionStoreException: Line 6 in XML document from class path resource [org/springframework/batch/core/jsr/configuration/xml/RetryListenerTestBase-context.xml] is invalid; nested exception is org.xml.sax.SAXParseException; lineNumber: 6; columnNumber: 77; cvc-complex-type.2.4.c: The matching wildcard is strict, but no declaration can be found for element 'job'.
	at org.springframework.beans.factory.parsing.FailFastProblemReporter.error(FailFastProblemReporter.java:72)
	at org.springframework.beans.factory.parsing.ReaderContext.error(ReaderContext.java:119)
	at org.springframework.beans.factory.parsing.ReaderContext.error(ReaderContext.java:104)
	at org.springframework.beans.factory.xml.DefaultBeanDefinitionDocumentReader.importBeanDefinitionResource(DefaultBeanDefinitionDocumentReader.java:266)
(95 more lines...)
org.springframework.beans.factory.parsing.BeanDefinitionParsingException: org.springframework.beans.factory.parsing.BeanDefinitionParsingException: Configuration problem: Failed to import bean definitions from relative location [RetryListenerTestBase-context.xml]
Offending resource: class path resource [org/springframework/batch/core/jsr/configuration/xml/RetryReadListenerRetryOnce.xml]; nested exception is org.springframework.beans.factory.xml.XmlBeanDefinitionStoreException: Line 6 in XML document from class path resource [org/springframework/batch/core/jsr/configuration/xml/RetryListenerTestBase-context.xml] is invalid; nested exception is org.xml.sax.SAXParseException; lineNumber: 6; columnNumber: 77; cvc-complex-type.2.4.c: The matching wildcard is strict, but no declaration can be found for element 'job'.
org.springframework.beans.factory.parsing.BeanDefinitionParsingException: Configuration problem: Failed to import bean definitions from relative location [RetryListenerTestBase-context.xml]
Offending resource: class path resource [org/springframework/batch/core/jsr/configuration/xml/RetryReadListenerRetryOnce.xml]; nested exception is org.springframework.beans.factory.xml.XmlBeanDefinitionStoreException: Line 6 in XML document from class path resource [org/springframework/batch/core/jsr/configuration/xml/RetryListenerTestBase-context.xml] is invalid; nested exception is org.xml.sax.SAXParseException; lineNumber: 6; columnNumber: 77; cvc-complex-type.2.4.c: The matching wildcard is strict, but no declaration can be found for element 'job'.
	at org.springframework.beans.factory.parsing.FailFastProblemReporter.error(FailFastProblemReporter.java:72)
	at org.springframework.beans.factory.parsing.ReaderContext.error(ReaderContext.java:119)
	at org.springframework.beans.factory.parsing.ReaderContext.error(ReaderContext.java:104)
	at org.springframework.beans.factory.xml.DefaultBeanDefinitionDocumentReader.importBeanDefinitionResource(DefaultBeanDefinitionDocumentReader.java:266)
(95 more lines...)
org.springframework.beans.factory.parsing.BeanDefinitionParsingException: org.springframework.beans.factory.parsing.BeanDefinitionParsingException: Configuration problem: Failed to import bean definitions from relative location [RetryListenerTestBase-context.xml]
Offending resource: class path resource [org/springframework/batch/core/jsr/configuration/xml/RetryReadListenerListenerException.xml]; nested exception is org.springframework.beans.factory.xml.XmlBeanDefinitionStoreException: Line 6 in XML document from class path resource [org/springframework/batch/core/jsr/configuration/xml/RetryListenerTestBase-context.xml] is invalid; nested exception is org.xml.sax.SAXParseException; lineNumber: 6; columnNumber: 77; cvc-complex-type.2.4.c: The matching wildcard is strict, but no declaration can be found for element 'job'.
org.springframework.beans.factory.parsing.BeanDefinitionParsingException: Configuration problem: Failed to import bean definitions from relative location [RetryListenerTestBase-context.xml]
Offending resource: class path resource [org/springframework/batch/core/jsr/configuration/xml/RetryReadListenerListenerException.xml]; nested exception is org.springframework.beans.factory.xml.XmlBeanDefinitionStoreException: Line 6 in XML document from class path resource [org/springframework/batch/core/jsr/configuration/xml/RetryListenerTestBase-context.xml] is invalid; nested exception is org.xml.sax.SAXParseException; lineNumber: 6; columnNumber: 77; cvc-complex-type.2.4.c: The matching wildcard is strict, but no declaration can be found for element 'job'.
	at org.springframework.beans.factory.parsing.FailFastProblemReporter.error(FailFastProblemReporter.java:72)
	at org.springframework.beans.factory.parsing.ReaderContext.error(ReaderContext.java:119)
	at org.springframework.beans.factory.parsing.ReaderContext.error(ReaderContext.java:104)
	at org.springframework.beans.factory.xml.DefaultBeanDefinitionDocumentReader.importBeanDefinitionResource(DefaultBeanDefinitionDocumentReader.java:266)
(95 more lines...)
java.lang.IllegalStateException: java.lang.IllegalStateException: Failed to load ApplicationContext
java.lang.IllegalStateException: Failed to load ApplicationContext
	at org.springframework.test.context.cache.DefaultCacheAwareContextLoaderDelegate.loadContext(DefaultCacheAwareContextLoaderDelegate.java:125)
	at org.springframework.test.context.support.DefaultTestContext.getApplicationContext(DefaultTestContext.java:108)
	at org.springframework.test.context.support.DependencyInjectionTestExecutionListener.injectDependencies(DependencyInjectionTestExecutionListener.java:118)
	at org.springframework.test.context.support.DependencyInjectionTestExecutionListener.prepareTestInstance(DependencyInjectionTestExecutionListener.java:83)
	at org.springframework.test.context.TestContextManager.prepareTestInstance(TestContextManager.java:244)
	at org.springframework.test.context.junit4.SpringJUnit4ClassRunner.createTest(SpringJUnit4ClassRunner.java:227)
(82 more lines...)
java.lang.IllegalStateException: java.lang.IllegalStateException: Failed to load ApplicationContext
java.lang.IllegalStateException: Failed to load ApplicationContext
	at org.springframework.test.context.cache.DefaultCacheAwareContextLoaderDelegate.loadContext(DefaultCacheAwareContextLoaderDelegate.java:125)
	at org.springframework.test.context.support.DefaultTestContext.getApplicationContext(DefaultTestContext.java:108)
	at org.springframework.test.context.support.DependencyInjectionTestExecutionListener.injectDependencies(DependencyInjectionTestExecutionListener.java:118)
	at org.springframework.test.context.support.DependencyInjectionTestExecutionListener.prepareTestInstance(DependencyInjectionTestExecutionListener.java:83)
	at org.springframework.test.context.TestContextManager.prepareTestInstance(TestContextManager.java:244)
	at org.springframework.test.context.junit4.SpringJUnit4ClassRunner.createTest(SpringJUnit4ClassRunner.java:227)
(82 more lines...)
java.lang.IllegalStateException: java.lang.IllegalStateException: Failed to load ApplicationContext
java.lang.IllegalStateException: Failed to load ApplicationContext
	at org.springframework.test.context.cache.DefaultCacheAwareContextLoaderDelegate.loadContext(DefaultCacheAwareContextLoaderDelegate.java:125)
	at org.springframework.test.context.support.DefaultTestContext.getApplicationContext(DefaultTestContext.java:108)
	at org.springframework.test.context.support.DependencyInjectionTestExecutionListener.injectDependencies(DependencyInjectionTestExecutionListener.java:118)
	at org.springframework.test.context.support.DependencyInjectionTestExecutionListener.prepareTestInstance(DependencyInjectionTestExecutionListener.java:83)
	at org.springframework.test.context.TestContextManager.prepareTestInstance(TestContextManager.java:244)
	at org.springframework.test.context.junit4.SpringJUnit4ClassRunner.createTest(SpringJUnit4ClassRunner.java:227)
(82 more lines...)

JIRA issues

IssueDescriptionStatus
Unknown Issue TypeLICENSE-2Could not obtain issue details from JIRA