Build #72

Nightly build for boot 2.3 (SD Neumann + Spring Integration 5.3)

Build: #72 failed Scheduled

Build result summary

Details

Completed
Duration
3 minutes
Labels
None
Agent
bamboo-12.af.pivotal.io
Revision
7c8646f1896bc6bef6a66d18a2ea92834fe07c92 7c8646f1896bc6bef6a66d18a2ea92834fe07c92
Total tests
1913
Fixed in
#74 (Scheduled)

Tests

Responsible

No one has taken responsibility for this failure

Tests

New test failures 1
Status Test View job Duration
Collapse Failed JsrSplitParsingTests test History
Default Job < 1 sec
java.lang.AssertionError: java.lang.AssertionError: expected:<COMPLETED> but was:<FAILED>
java.lang.AssertionError: expected:<COMPLETED> but was:<FAILED>
	at org.junit.Assert.fail(Assert.java:88)
	at org.junit.Assert.failNotEquals(Assert.java:834)
	at org.junit.Assert.assertEquals(Assert.java:118)
	at org.junit.Assert.assertEquals(Assert.java:144)
	at org.springframework.batch.core.jsr.configuration.xml.JsrSplitParsingTests.test(JsrSplitParsingTests.java:49)
	at sun.reflect.NativeMethodAccessorImpl.invoke0(Native Method)
(46 more lines...)