Build #86

Nightly build for boot 2.3 (SD Neumann + Spring Integration 5.3)

Build: #86 failed Scheduled

Build result summary

Details

Completed
Duration
3 minutes
Labels
None
Agent
bamboo-23.af.pivotal.io
Revision
abecad5c823c082e68550344ccd3520bd26ef467 abecad5c823c082e68550344ccd3520bd26ef467
Total tests
1914
Failing since
#85 (Scheduled – )

Responsible

This build has been failing since #85
No one has taken responsibility

Tests

Existing test failures 1
Status Test Failing since View job Duration
java.lang.AssertionError: java.lang.AssertionError: Received a FAILED because of org.springframework.batch.core.JobExecutionException: Flow execution ended unexpectedly
	at org.springframework.batch.core.jsr.job.flow.JsrFlowJob.doExecute(JsrFlowJob.java:88)
	at org.springframework.batch.core.job.AbstractJob.execute(AbstractJob.java:319)
	at org.springframework.batch.core.jsr.launch.JsrJobOperator$2.run(JsrJobOperator.java:674)
	at java.lang.Thread.run(Thread.java:748)
Caused by: org.springframework.batch.core.job.flow.FlowExecutionException: Ended flow=flow2.step1 at state=flow2.step1.flow2.step1 with exception
	at org.springframework.batch.core.job.flow.support.SimpleFlow.resume(SimpleFlow.java:178)
	at org.springframework.batch.core.job.flow.support.SimpleFlow.start(SimpleFlow.java:144)
(92 more lines...)
Fixed tests 1
Status Test Failing since View job Duration
Successful JsrSplitParsingTests test History
Failing since build #85 (Scheduled) Default Job < 1 sec