Build #4,312

Build: #4312 failed Scheduled

Logs

The following logs have been generated by the jobs in this plan.
  • Expand all
  • Collapse all
Job Logs
Collapse Default Job Default Stage Download or View
13-Jan-2019 20:06:58
13-Jan-2019 20:06:58 org.springframework.batch.sample.JobOperatorFunctionalTests > testMultipleSimultaneousInstances FAILED
13-Jan-2019 20:06:58     java.lang.AssertionError at JobOperatorFunctionalTests.java:134
13-Jan-2019 20:07:29
13-Jan-2019 20:07:29 128 tests completed, 1 failed
13-Jan-2019 20:07:29
13-Jan-2019 20:07:29 > Task :spring-batch-samples:test FAILED
13-Jan-2019 20:07:29
13-Jan-2019 20:07:29 Deprecated Gradle features were used in this build, making it incompatible with Gradle 5.0.
13-Jan-2019 20:07:29 Use '--warning-mode all' to show the individual deprecation warnings.
13-Jan-2019 20:07:29 See https://docs.gradle.org/4.10/userguide/command_line_interface.html#sec:command_line_warnings
13-Jan-2019 20:07:29 81 actionable tasks: 72 executed, 9 up-to-date
13-Jan-2019 20:07:29
13-Jan-2019 20:07:29 FAILURE: Build failed with an exception.
13-Jan-2019 20:07:29
13-Jan-2019 20:07:29 * What went wrong:
13-Jan-2019 20:07:29 Execution failed for task ':spring-batch-samples:test'.
13-Jan-2019 20:07:29 > There were failing tests. See the report at: file:///opt/bamboo-home/xml-data/build-dir/BATCH-NIGHTLY-JOB1/spring-batch-samples/build/reports/tests/test/index.html
13-Jan-2019 20:07:29
13-Jan-2019 20:07:29 * Try:
13-Jan-2019 20:07:29 Run with --stacktrace option to get the stack trace. Run with --info or --debug option to get more log output. Run with --scan to get full insights.
13-Jan-2019 20:07:29
13-Jan-2019 20:07:29 * Get more help at https://help.gradle.org
13-Jan-2019 20:07:29
13-Jan-2019 20:07:29 BUILD FAILED in 7m 14s