Build #4,731

Build: #4731 failed Scheduled

Logs

The following logs have been generated by the jobs in this plan.
  • Expand all
  • Collapse all
Job Logs
Collapse Default Job Default Stage Download or View
26-Feb-2020 20:02:39
26-Feb-2020 20:02:39 org.springframework.batch.core.repository.dao.OptimisticLockingFailureTests > testAsyncStopOfStartingJob FAILED
26-Feb-2020 20:02:39     org.springframework.batch.core.repository.JobExecutionAlreadyRunningException at OptimisticLockingFailureTests.java:73
26-Feb-2020 20:03:10
26-Feb-2020 20:03:10 1914 tests completed, 1 failed, 7 skipped
26-Feb-2020 20:03:10
26-Feb-2020 20:03:10 FAILURE: Build failed with an exception.
26-Feb-2020 20:03:10
26-Feb-2020 20:03:10 * What went wrong:
26-Feb-2020 20:03:10 Execution failed for task ':spring-batch-core:test'.
26-Feb-2020 20:03:10 > There were failing tests. See the report at: file:///opt/bamboo-home/xml-data/build-dir/BATCH-NIGHTLY-JOB1/spring-batch-core/build/reports/tests/test/index.html
26-Feb-2020 20:03:10
26-Feb-2020 20:03:10 * Try:
26-Feb-2020 20:03:10 Run with --stacktrace option to get the stack trace. Run with --info or --debug option to get more log output. Run with --scan to get full insights.
26-Feb-2020 20:03:10
26-Feb-2020 20:03:10 * Get more help at https://help.gradle.org
26-Feb-2020 20:03:10
26-Feb-2020 20:03:10 BUILD FAILED in 2m 58s
26-Feb-2020 20:03:10
26-Feb-2020 20:03:10 > Task :spring-batch-core:test FAILED
26-Feb-2020 20:03:10
26-Feb-2020 20:03:10 Deprecated Gradle features were used in this build, making it incompatible with Gradle 7.0.
26-Feb-2020 20:03:10 Use '--warning-mode all' to show the individual deprecation warnings.
26-Feb-2020 20:03:10 See https://docs.gradle.org/6.0.1/userguide/command_line_interface.html#sec:command_line_warnings
26-Feb-2020 20:03:10 44 actionable tasks: 35 executed, 9 up-to-date