Build #4,731

Build: #4731 failed Scheduled

Test results

  • 1,914 tests in total
  • 1 test failed
  • 1 failure is new
  • 7 tests were quarantined / skipped
  • 43 seconds taken in total.
New test failures 1
Status Test View job Duration
Collapse Failed OptimisticLockingFailureTests testAsyncStopOfStartingJob History
Default Job 2 secs
org.springframework.batch.core.repository.JobExecutionAlreadyRunningException: org.springframework.batch.core.repository.JobExecutionAlreadyRunningException: A job execution for this job is already running: JobInstance: id=0, version=0, Job=[locking]
org.springframework.batch.core.repository.JobExecutionAlreadyRunningException: A job execution for this job is already running: JobInstance: id=0, version=0, Job=[locking]
	at org.springframework.batch.core.repository.support.SimpleJobRepository.createJobExecution(SimpleJobRepository.java:121)
	at sun.reflect.GeneratedMethodAccessor112.invoke(Unknown Source)
	at sun.reflect.DelegatingMethodAccessorImpl.invoke(DelegatingMethodAccessorImpl.java:43)
	at java.lang.reflect.Method.invoke(Method.java:498)
	at org.springframework.aop.support.AopUtils.invokeJoinpointUsingReflection(AopUtils.java:344)
	at org.springframework.aop.framework.ReflectiveMethodInvocation.invokeJoinpoint(ReflectiveMethodInvocation.java:198)
(58 more lines...)
Skipped tests 7
Status Test Failing since View job
Skipped ItemListenerErrorTests testOnReadError History
Default Job
Skipped JobRepositoryFactoryBeanTests testTransactionAttributesForCreateMethodNullHypothesis History
Default Job
Skipped StepScopeClassIntegrationTests testSimpleValue History
Default Job
Skipped StepScopeClassIntegrationTests testNested History
Default Job
Skipped FaultTolerantStepFactoryBeanUnexpectedRollbackTests testTransactionException History
Default Job
Skipped AsyncChunkOrientedStepIntegrationTests testStatus History
Default Job
Skipped ChunkOrientedStepIntegrationTests testStatusForCommitFailedException History
Default Job