Build #4,759

Build: #4759 failed Scheduled with changes by Mahmoud Ben Hassine

Build result summary

Details

Completed
Duration
4 minutes
Labels
None
Agent
bamboo-11.af.pivotal.io
Revision
d933e4d7df62cb07badcb8263f96d9002300a1b1 d933e4d7df62cb07badcb8263f96d9002300a1b1
Total tests
1914
Fixed in
#4760 (Scheduled)

Tests

Responsible

Code commits

Author Commit Message Commit date
Mahmoud Ben Hassine Mahmoud Ben Hassine d933e4d7df62cb07badcb8263f96d9002300a1b1 d933e4d7df62cb07badcb8263f96d9002300a1b1 Upgrade Gradle to v6.3 to support Java 14
This commit also upgrades Groovy version to v2.5.10
which is required to build correctly against Java 14

Resolves #3685

Tests

New test failures 1
Status Test View job Duration
Collapse Failed JsrSplitParsingTests test History
Default Job < 1 sec
java.lang.AssertionError: java.lang.AssertionError: expected:<COMPLETED> but was:<FAILED>
java.lang.AssertionError: expected:<COMPLETED> but was:<FAILED>
	at org.junit.Assert.fail(Assert.java:89)
	at org.junit.Assert.failNotEquals(Assert.java:835)
	at org.junit.Assert.assertEquals(Assert.java:120)
	at org.junit.Assert.assertEquals(Assert.java:146)
	at org.springframework.batch.core.jsr.configuration.xml.JsrSplitParsingTests.test(JsrSplitParsingTests.java:49)
	at sun.reflect.NativeMethodAccessorImpl.invoke0(Native Method)
(48 more lines...)