Build #4,312

Build: #4312 failed

Job: Default Job failed

Stages & jobs

  1. Default Stage

Build log

The build generated 412 lines of output. Download or view full build log

13-Jan-2019 20:00:00 Build Spring Batch - nightly - Default Job #4312 (BATCH-NIGHTLY-JOB1-4312) started building on agent bamboo-13.af.pivotal.io
13-Jan-2019 20:00:00 Remote agent on host bamboo-13.af.pivotal.io
13-Jan-2019 20:00:00 Build working directory is /opt/bamboo-home/xml-data/build-dir/BATCH-NIGHTLY-JOB1
13-Jan-2019 20:00:00 Executing build Spring Batch - nightly - Default Job #4312 (BATCH-NIGHTLY-JOB1-4312)
13-Jan-2019 20:00:00 Starting task 'Checkout Default Repository' of type 'com.atlassian.bamboo.plugins.vcs:task.vcs.checkout'
13-Jan-2019 20:00:00 Build always requires a clean checkout
13-Jan-2019 20:00:00 Cleaning build directory '/opt/bamboo-home/xml-data/build-dir/BATCH-NIGHTLY-JOB1'
13-Jan-2019 20:00:00 Checking out into /opt/bamboo-home/xml-data/build-dir/BATCH-NIGHTLY-JOB1
13-Jan-2019 20:00:00 Updating source code to revision: 7ca11f2f998e5e46b35ec7a56fcd0e62b572b667
13-Jan-2019 20:00:00 Creating local git repository in '/opt/bamboo-home/xml-data/build-dir/BATCH-NIGHTLY-JOB1/.git'.
13-Jan-2019 20:00:00 Initialized empty Git repository in /opt/bamboo-home/xml-data/build-dir/BATCH-NIGHTLY-JOB1/.git/
13-Jan-2019 20:00:01 Fetching 'refs/heads/master' from 'git://github.com/spring-projects/spring-batch'.
13-Jan-2019 20:00:14 From git://github.com/spring-projects/spring-batch
13-Jan-2019 20:00:14 * [new branch]      master     -> master
13-Jan-2019 20:00:14 * [new tag]         2.2.0.M1   -> 2.2.0.M1
13-Jan-2019 20:00:14 * [new tag]         2.2.0.RC1  -> 2.2.0.RC1
13-Jan-2019 20:00:14 * [new tag]         2.2.0.RC2  -> 2.2.0.RC2
13-Jan-2019 20:00:14 * [new tag]         2.2.0.RELEASE -> 2.2.0.RELEASE
13-Jan-2019 20:00:14 * [new tag]         2.2.1.RELEASE -> 2.2.1.RELEASE
13-Jan-2019 20:00:14 * [new tag]         3.0.0.M1   -> 3.0.0.M1
13-Jan-2019 20:00:14 * [new tag]         3.0.0.M2   -> 3.0.0.M2
13-Jan-2019 20:00:14 * [new tag]         3.0.0.M3   -> 3.0.0.M3
13-Jan-2019 20:00:14 * [new tag]         4.1.0.M2   -> 4.1.0.M2
13-Jan-2019 20:00:14 * [new tag]         4.1.0.M3   -> 4.1.0.M3
13-Jan-2019 20:00:14 * [new tag]         4.1.0.RC1  -> 4.1.0.RC1
13-Jan-2019 20:00:14 * [new tag]         4.1.0.RELEASE -> 4.1.0.RELEASE
13-Jan-2019 20:00:14 Checking out revision 7ca11f2f998e5e46b35ec7a56fcd0e62b572b667.
13-Jan-2019 20:00:14 Already on 'master'
13-Jan-2019 20:00:14 Updated source code to revision: 7ca11f2f998e5e46b35ec7a56fcd0e62b572b667
13-Jan-2019 20:00:14 Finished task 'Checkout Default Repository' with result: Success
13-Jan-2019 20:00:14 Running pre-build action: Artifactory Release Staging
13-Jan-2019 20:00:14 Running pre-build action: VCS Version Collector
13-Jan-2019 20:00:14 Starting task 'Nightly Snapshot' of type 'org.jfrog.bamboo.bamboo-artifactory-plugin:artifactoryGradleTask'
13-Jan-2019 20:00:14 Bamboo Artifactory Plugin version: 2.5.x-SNAPSHOT
13-Jan-2019 20:00:14
Beginning to execute external process for build 'Spring Batch - nightly - Default Job #4312 (BATCH-NIGHTLY-JOB1-4312)'
... running command line:
./gradlew clean build dist jacocoTestReport runTck -I /tmp/artifactory.init.script2214020899050590661gradle -DbuildInfoConfig.propertiesFile=/tmp/buildinfo6283918036178226621properties artifactoryPublish -Dartifactory.resolve.password=******** -Dartifactory.publish.password=********
... in: /opt/bamboo-home/xml-data/build-dir/BATCH-NIGHTLY-JOB1
... using extra environment variables:
bamboo_planRepository_1_branch=master
IRBRC=/home/bamboo/.rvm/rubies/ruby-2.3.0/.irbrc
bamboo_********_username_password=********
bamboo_signing_store_password=********
bamboo_capability_system_builder_ant_Ant_1_9=/opt/ant-1.9
bamboo_capability_system_builder_ant_Ant_1_8=/opt/ant-1.8
bamboo_planRepository_1_branchDisplayName=master
bamboo_capability_system_jdk_OpenJDK_7u181=/opt/openjdk-7
bamboo_repository_revision_number=7ca11f2f998e5e46b35ec7a56fcd0e62b572b667
bamboo_capability_system_builder_node_Node_js_6=/usr/bin/node
bamboo_RIAK_BIN=/usr/sbin/riak
WRAPPER_BITS=32
bamboo_buildKey=BATCH-NIGHTLY-JOB1
rvm_loaded_flag=1
bamboo_sonar_token_password=********
rvm_version=1.27.0 (latest)
PWD=/opt/bamboo-home/bin
bamboo_repository_152043527_branch_name=master
bamboo_shortJobName=Default Job
bamboo_capability_system_builder_gradle___gradlew=./gradlew
bamboo_buildResultsUrl=https://build.spring.io/browse/BATCH-NIGHTLY-JOB1-4312
bamboo_capability_system_builder_mvn3_Maven_3_3=/opt/maven-3.3
bamboo_capability_system_builder_mvn3_Maven_3_2=/opt/maven-3.2
bamboo_capability_system_builder_mvn3_Maven_3_1=/opt/maven-3.1
bamboo_planRepository_repositoryUrl=git://github.com/spring-projects/spring-batch
bamboo_agentId=208568333
bamboo_capability_system_builder_mvn3_Maven_3_5=/opt/maven-3.5
MY_RUBY_HOME=/home/bamboo/.rvm/rubies/ruby-2.3.0
bamboo_capability_system_builder_mvn3_Maven_3_0=/opt/maven-3.0
bamboo_repository_152043527_previous_revision_number=7ca11f2f998e5e46b35ec7a56fcd0e62b572b667
rvm_path=/home/bamboo/.rvm
bamboo_planRepository_revision=7ca11f2f998e5e46b35ec7a56fcd0e62b572b667
bamboo_planRepository_previousRevision=7ca11f2f998e5e46b35ec7a56fcd0e62b572b667
bamboo_capability_remote_build=true
bamboo_repository_branch_name=master
SHLVL=1
bamboo_org_jfrog_bamboo_buildInfo_serverUrl=https://repo.spring.io
bamboo_scdf_acceptance_tests_password=********
WRAPPER_OS=linux
JAVA_HOME=/opt/jdk-8/
EC2_HOME=/opt/ec2-api-tools
XDG_SESSION_ID=c1
bamboo_capability_Agent=bamboo-13.af.pivotal.io
bamboo_planRepository_branch=master
bamboo_org_jfrog_bamboo_release_activated=false
bamboo_planRepository_1_type=gitv2
bamboo_planRepository_branchName=master
WRAPPER_FILE_SEPARATOR=/
_=/opt/bamboo-home/bin/bamboo-agent.sh
WRAPPER_PATH_SEPARATOR=:
bamboo_sonar_password=********
bamboo_hg_cache_directory=/opt/bamboo-home/xml-data/build-dir/_hg-repositories-cache
bamboo_planRepository_1_username=
bamboo_planRepository_type=gitv2
bamboo_git_cache_directory=/opt/bamboo-home/xml-data/build-dir/_git-repositories-cache
bamboo_artifactory_username=buildmaster
rvm_stored_umask=0002
bamboo_tmp_directory=/opt/bamboo-home/temp
GEM_PATH=/home/bamboo/.rvm/gems/ruby-2.3.0:/home/bamboo/.rvm/gems/ruby-2.3.0@global
bamboo_planKey=BATCH-NIGHTLY
bamboo_planRepository_username=
bamboo_JDK8_HOME=/opt/jdk-8
NLSPATH=/usr/dt/lib/nls/msg/%L/%N.cat
bamboo_planRepository_1_branchName=master
bamboo_sonar_version=5.6.3
XDG_DATA_DIRS=/usr/local/share:/usr/share:/var/lib/snapd/desktop
bamboo_capability_system_jdk_JDK_1_11=/opt/jdk-11
bamboo_resultsUrl=https://build.spring.io/browse/BATCH-NIGHTLY-JOB1-4312
bamboo_repository_152043527_revision_number=7ca11f2f998e5e46b35ec7a56fcd0e62b572b667
bamboo_capability_system_jdk_JDK_1_10=/opt/jdk-10
bamboo_build_working_directory=/opt/bamboo-home/xml-data/build-dir/BATCH-NIGHTLY-JOB1
bamboo_planRepository_1_name=Git
bamboo_capability_system_os=ubuntu1604
bamboo_nexusPush_stagingProfile=buildmaster
bamboo_shortPlanName=nightly
MAIL=/var/mail/bamboo
bamboo_planRepository_name=Git
LOGNAME=bamboo
bamboo_buildNumber=4312
rvm_user_install_flag=1
SHELL=/bin/bash
bamboo_planName=Spring Batch - nightly
bamboo_JDK7_HOME=/opt/jdk-7
bamboo_shortPlanKey=NIGHTLY
OLDPWD=/opt/users/bamboo
GEM_HOME=/home/bamboo/.rvm/gems/ruby-2.3.0
bamboo_shortJobKey=JOB1
bamboo_artifactory_password=********
bamboo_buildTimeStamp=2019-01-13T20:00:00.796Z
bamboo_repository_previous_revision_number=7ca11f2f998e5e46b35ec7a56fcd0e62b572b667
RUBY_VERSION=ruby-2.3.0
bamboo_sonar_username=buildmaster
_system_name=Ubuntu
bamboo_********_password=********
bamboo_repository_git_branch=master
bamboo_buildResultKey=BATCH-NIGHTLY-JOB1-4312
bamboo_nexusPush_close=true
bamboo_buildPlanName=Spring Batch - nightly - Default Job
bamboo_repository_152043527_git_repositoryUrl=git://github.com/spring-projects/spring-batch
bamboo_planRepository_1_revision=7ca11f2f998e5e46b35ec7a56fcd0e62b572b667
bamboo_repository_152043527_git_username=
_system_arch=x86_64
bamboo_repository_name=Git
rvm_bin_path=/home/bamboo/.rvm/bin
bamboo_signing_key_password=********
JSR_352_TCK_HOME=/home/bamboo/workspace/jsr352-tck-1.0
XFILESEARCHPATH=/usr/dt/app-defaults/%L/Dt
rvm_prefix=/home/bamboo
LANG=en_US.UTF-8
bamboo_buildFailed=false
bamboo_capability_system_docker_executable=/usr/bin/docker
DISPLAY=localhost:1.0
bamboo_capability_system_builder_groovy_Groovy_2_4=/opt/groovy-2.4
bamboo_artifactory_password_mask_b=********
bamboo_capability_system_builder_command_Bash=/bin/bash
bamboo_artifactory_password_mask_a=********
bamboo_agentWorkingDirectory=/opt/bamboo-home/xml-data/build-dir
bamboo_capability_system_git_executable=/usr/bin/git
bamboo_repository_git_username=
bamboo_planRepository_1_previousRevision=7ca11f2f998e5e46b35ec7a56fcd0e62b572b667
bamboo_capability_os_family=unix
NVM_NODEJS_ORG_MIRROR=http://nodejs.org/dist
bamboo_planRepository_branchDisplayName=master
NODE_PATH=/usr/lib/nodejs:/usr/lib/node_modules:/usr/share/javascript
bamboo_capability_system_builder_maven_Artifactory_Maven_3_5=/opt/maven-3.5
bamboo_repository_152043527_git_branch=master
GIT_SSL_NO_VERIFY=true
bamboo_capability_system_builder_maven_Artifactory_Maven_3_3=/opt/maven-3.3
NVM_DIR=/home/bamboo/.nvm
bamboo_capability_system_builder_maven_Artifactory_Maven_3_2=/opt/maven-3.2
bamboo_s3_properties=/home/bamboo/tools/s3.properties
bamboo_capability_system_builder_maven_Artifactory_Maven_3_1=/opt/maven-3.1
bamboo_capability_system_builder_maven_Artifactory_Maven_3_0=/opt/maven-3.0
_system_type=Linux
bamboo_plan_storageTag=BATCH-NIGHTLY
_system_version=16.04
USER=bamboo
bamboo_repository_git_repositoryUrl=git://github.com/spring-projects/spring-batch
bamboo_working_directory=/opt/bamboo-home/xml-data/build-dir/BATCH-NIGHTLY-JOB1
bamboo_org_jfrog_bamboo_buildInfo_activated=true
bamboo_planRepository_1_repositoryUrl=git://github.com/spring-projects/spring-batch
bamboo_capability_system_jdk_JDK_1_8=/opt/jdk-8
bamboo_capability_system_jdk_JDK_1_9=/opt/jdk-9
WRAPPER_ARCH=x86
bamboo_capability_system_jdk_JDK_1_6=/opt/jdk-6
bamboo_capability_system_jdk_JDK_1_7=/opt/jdk-7
bamboo_sonar_ip=10.194.6.9
XDG_RUNTIME_DIR=/run/user/505
bamboo_repository_152043527_name=Git
HOME=/home/bamboo
PATH=/bin:/home/bamboo/.rvm/gems/ruby-2.3.0/bin:/home/bamboo/.rvm/gems/ruby-2.3.0@global/bin:/home/bamboo/.rvm/rubies/ruby-2.3.0/bin:/home/bamboo/bin:/usr/local/bin:/usr/bin:/bin:/usr/local/games:/usr/games:/snap/bin:/home/bamboo/bin:/usr/local/bin:/opt/ec2-api-tools/bin:/home/bamboo/.rvm/bin:/bin:/home/bamboo/.rvm/gems/ruby-2.3.0/bin:/home/bamboo/.rvm/gems/ruby-2.3.0@global/bin:/home/bamboo/.rvm/rubies/ruby-2.3.0/bin:/home/bamboo/bin:/usr/local/bin:/usr/bin:/bin:/usr/local/games:/usr/games:/snap/bin:/home/bamboo/bin:/usr/local/bin:/opt/ec2-api-tools/bin:/home/bamboo/.rvm/bin
13-Jan-2019 20:00:15 Starting a Gradle Daemon (subsequent builds will be faster)
13-Jan-2019 20:00:24 > Task :buildSrc:compileJava NO-SOURCE
13-Jan-2019 20:00:27 > Task :buildSrc:compileGroovy
13-Jan-2019 20:00:27 > Task :buildSrc:processResources
13-Jan-2019 20:00:27 > Task :buildSrc:classes
13-Jan-2019 20:00:27 > Task :buildSrc:jar
13-Jan-2019 20:00:27 > Task :buildSrc:assemble
13-Jan-2019 20:00:27 > Task :buildSrc:compileTestJava NO-SOURCE
13-Jan-2019 20:00:27 > Task :buildSrc:compileTestGroovy NO-SOURCE
13-Jan-2019 20:00:27 > Task :buildSrc:processTestResources NO-SOURCE
13-Jan-2019 20:00:27 > Task :buildSrc:testClasses UP-TO-DATE
13-Jan-2019 20:00:27 > Task :buildSrc:test NO-SOURCE
13-Jan-2019 20:00:27 > Task :buildSrc:check UP-TO-DATE
13-Jan-2019 20:00:27 > Task :buildSrc:build
13-Jan-2019 20:00:35 Cannot publish pom for project ':' since it does not contain the Maven plugin install task and task ':artifactoryPublish' does not specify a custom pom path.
13-Jan-2019 20:00:35 Cannot publish pom for project ':spring-build-src' since it does not contain the Maven plugin install task and task ':spring-build-src:artifactoryPublish' does not specify a custom pom path.
13-Jan-2019 20:00:35 > Task :clean UP-TO-DATE
13-Jan-2019 20:00:35 > Task :spring-batch-core:clean UP-TO-DATE
13-Jan-2019 20:00:35 > Task :spring-batch-core-tests:clean UP-TO-DATE
13-Jan-2019 20:00:35 > Task :spring-batch-docs:clean UP-TO-DATE
13-Jan-2019 20:00:35 > Task :spring-batch-infrastructure:clean UP-TO-DATE
13-Jan-2019 20:00:35 > Task :spring-batch-infrastructure-tests:clean UP-TO-DATE
13-Jan-2019 20:00:35 > Task :spring-batch-integration:clean UP-TO-DATE
13-Jan-2019 20:00:35 > Task :spring-batch-samples:clean UP-TO-DATE
13-Jan-2019 20:00:35 > Task :spring-batch-test:clean UP-TO-DATE
13-Jan-2019 20:00:35 > Task :spring-build-src:clean
13-Jan-2019 20:00:55
13-Jan-2019 20:00:55 > Task :spring-batch-infrastructure:compileJava
13-Jan-2019 20:00:55 /opt/bamboo-home/xml-data/build-dir/BATCH-NIGHTLY-JOB1/spring-batch-infrastructure/src/main/java/org/springframework/batch/item/database/HibernateItemReaderHelper.java:23: warning: [deprecation] Query in org.hibernate has been deprecated
13-Jan-2019 20:00:55 import org.hibernate.Query;
13-Jan-2019 20:00:55                     ^
13-Jan-2019 20:00:55 /opt/bamboo-home/xml-data/build-dir/BATCH-NIGHTLY-JOB1/spring-batch-infrastructure/src/main/java/org/springframework/batch/item/data/MongoItemReader.java:26: warning: [deprecation] JSON in com.mongodb.util has been deprecated
13-Jan-2019 20:00:55 import com.mongodb.util.JSON;
13-Jan-2019 20:00:55                        ^
13-Jan-2019 20:00:55 warning: No processor claimed any of these annotations: org.springframework.lang.NonNullApi,org.springframework.lang.Nullable
13-Jan-2019 20:00:55 /opt/bamboo-home/xml-data/build-dir/BATCH-NIGHTLY-JOB1/spring-batch-infrastructure/src/main/java/org/springframework/batch/item/database/HibernateItemReaderHelper.java:23: warning: [deprecation] Query in org.hibernate has been deprecated
13-Jan-2019 20:00:55 import org.hibernate.Query;
13-Jan-2019 20:00:55                     ^
13-Jan-2019 20:00:55 /opt/bamboo-home/xml-data/build-dir/BATCH-NIGHTLY-JOB1/spring-batch-infrastructure/src/main/java/org/springframework/batch/item/data/MongoItemReader.java:26: warning: [deprecation] JSON in com.mongodb.util has been deprecated
13-Jan-2019 20:00:55 import com.mongodb.util.JSON;
13-Jan-2019 20:00:55                        ^
13-Jan-2019 20:00:55 /opt/bamboo-home/xml-data/build-dir/BATCH-NIGHTLY-JOB1/spring-batch-infrastructure/src/main/java/org/springframework/batch/item/database/HibernateItemReaderHelper.java:23: warning: [deprecation] Query in org.hibernate has been deprecated
13-Jan-2019 20:00:55 import org.hibernate.Query;
13-Jan-2019 20:00:55                     ^
13-Jan-2019 20:00:55 /opt/bamboo-home/xml-data/build-dir/BATCH-NIGHTLY-JOB1/spring-batch-infrastructure/src/main/java/org/springframework/batch/item/data/MongoItemReader.java:26: warning: [deprecation] JSON in com.mongodb.util has been deprecated
13-Jan-2019 20:00:55 import com.mongodb.util.JSON;
13-Jan-2019 20:00:55                        ^
13-Jan-2019 20:00:55 /opt/bamboo-home/xml-data/build-dir/BATCH-NIGHTLY-JOB1/spring-batch-infrastructure/src/main/java/org/springframework/batch/item/support/builder/CompositeItemWriterBuilder.java:81: warning: [unchecked] Possible heap pollution from parameterized vararg type ItemWriter<? super T>
13-Jan-2019 20:00:55         public CompositeItemWriterBuilder<T> delegates(ItemWriter<? super T>... delegates) {
13-Jan-2019 20:00:55                                                                                 ^
13-Jan-2019 20:00:55   where T is a type-variable:
13-Jan-2019 20:00:55     T extends Object declared in class CompositeItemWriterBuilder
13-Jan-2019 20:00:55 /opt/bamboo-home/xml-data/build-dir/BATCH-NIGHTLY-JOB1/spring-batch-infrastructure/src/main/java/org/springframework/batch/item/database/HibernateItemReaderHelper.java:123: warning: [deprecation] Query in org.hibernate has been deprecated
13-Jan-2019 20:00:55                 Query query = createQuery();
13-Jan-2019 20:00:55                 ^
13-Jan-2019 20:00:55 /opt/bamboo-home/xml-data/build-dir/BATCH-NIGHTLY-JOB1/spring-batch-infrastructure/src/main/java/org/springframework/batch/item/database/HibernateItemReaderHelper.java:135: warning: [deprecation] Query in org.hibernate has been deprecated
13-Jan-2019 20:00:55         public Query createQuery() {
13-Jan-2019 20:00:55                ^
13-Jan-2019 20:00:55 /opt/bamboo-home/xml-data/build-dir/BATCH-NIGHTLY-JOB1/spring-batch-infrastructure/src/main/java/org/springframework/batch/item/database/HibernateItemReaderHelper.java:222: warning: [deprecation] Query in org.hibernate has been deprecated
13-Jan-2019 20:00:55                 Query query = createQuery();
13-Jan-2019 20:00:55                 ^
13-Jan-2019 20:00:56 /opt/bamboo-home/xml-data/build-dir/BATCH-NIGHTLY-JOB1/spring-batch-infrastructure/src/main/java/org/springframework/batch/item/data/builder/RepositoryItemWriterBuilder.java:43: warning: [rawtypes] found raw type: RepositoryMethodReference
13-Jan-2019 20:00:56         private RepositoryMethodReference repositoryMethodReference;
13-Jan-2019 20:00:56                 ^
13-Jan-2019 20:00:56   missing type arguments for generic class RepositoryMethodReference<T>
13-Jan-2019 20:00:56   where T is a type-variable:
13-Jan-2019 20:00:56     T extends Object declared in class RepositoryMethodReference
13-Jan-2019 20:00:56 /opt/bamboo-home/xml-data/build-dir/BATCH-NIGHTLY-JOB1/spring-batch-infrastructure/src/main/java/org/springframework/batch/item/data/builder/RepositoryItemWriterBuilder.java:90: warning: [rawtypes] found raw type: RepositoryMethodReference
13-Jan-2019 20:00:56         public RepositoryItemWriterBuilder<T> repository(RepositoryItemWriterBuilder.RepositoryMethodReference repositoryMethodReference) {
13-Jan-2019 20:00:56                                                                                     ^
13-Jan-2019 20:00:56   missing type arguments for generic class RepositoryMethodReference<T>
13-Jan-2019 20:00:56   where T is a type-variable:
13-Jan-2019 20:00:56     T extends Object declared in class RepositoryMethodReference
13-Jan-2019 20:00:56 /opt/bamboo-home/xml-data/build-dir/BATCH-NIGHTLY-JOB1/spring-batch-infrastructure/src/main/java/org/springframework/batch/item/data/builder/RepositoryItemWriterBuilder.java:104: warning: [unchecked] unchecked conversion
13-Jan-2019 20:00:56                         this.repository = this.repositoryMethodReference.getRepository();
13-Jan-2019 20:00:56                                                                                       ^
13-Jan-2019 20:00:56   required: CrudRepository<T,?>
13-Jan-2019 20:00:56   found:    CrudRepository
13-Jan-2019 20:00:56   where T is a type-variable:
13-Jan-2019 20:00:56     T extends Object declared in class RepositoryItemWriterBuilder
13-Jan-2019 20:00:56 /opt/bamboo-home/xml-data/build-dir/BATCH-NIGHTLY-JOB1/spring-batch-infrastructure/src/main/java/org/springframework/batch/item/data/MongoItemReader.java:264: warning: [deprecation] JSON in com.mongodb.util has been deprecated
13-Jan-2019 20:00:56                 return JSON.serialize(values.get(index));
13-Jan-2019 20:00:56                        ^
13-Jan-2019 20:00:56 15 warnings
13-Jan-2019 20:01:02
13-Jan-2019 20:01:02 > Task :spring-batch-infrastructure:processResources NO-SOURCE
13-Jan-2019 20:01:02 > Task :spring-batch-infrastructure:classes
13-Jan-2019 20:01:02 > Task :spring-batch-infrastructure:jar
13-Jan-2019 20:01:04 warning: No processor claimed any of these annotations: org.springframework.beans.factory.annotation.Autowired,org.springframework.context.annotation.Import,org.aspectj.lang.annotation.Around,org.springframework.context.annotation.Scope,org.springframework.context.annotation.Configuration,org.springframework.lang.NonNullApi,org.springframework.stereotype.Component,org.aspectj.lang.annotation.Aspect,org.springframework.beans.factory.annotation.Qualifier,com.fasterxml.jackson.annotation.JsonIgnore,javax.annotation.PostConstruct,org.springframework.lang.Nullable,org.springframework.context.annotation.Bean,org.springframework.transaction.annotation.Transactional
13-Jan-2019 20:01:04
13-Jan-2019 20:01:04 > Task :spring-batch-core:compileJava
13-Jan-2019 20:01:05 /opt/bamboo-home/xml-data/build-dir/BATCH-NIGHTLY-JOB1/spring-batch-core/src/main/java/org/springframework/batch/core/step/builder/SimpleStepBuilder.java:232: warning: [overloads] processor(ItemProcessor<? super I,? extends O>) in SimpleStepBuilder is potentially ambiguous with processor(Function<? super I,? extends O>) in SimpleStepBuilder
13-Jan-2019 20:01:05         public SimpleStepBuilder<I, O> processor(ItemProcessor<? super I, ? extends O> processor) {
13-Jan-2019 20:01:05                                        ^
13-Jan-2019 20:01:05   where I,O are type-variables:
13-Jan-2019 20:01:05     I extends Object declared in class SimpleStepBuilder
13-Jan-2019 20:01:05     O extends Object declared in class SimpleStepBuilder
13-Jan-2019 20:01:05 /opt/bamboo-home/xml-data/build-dir/BATCH-NIGHTLY-JOB1/spring-batch-core/src/main/java/org/springframework/batch/core/jsr/configuration/support/SpringAutowiredAnnotationBeanPostProcessor.java:264: warning: [deprecation] postProcessPropertyValues(PropertyValues,PropertyDescriptor[],Object,String) in InstantiationAwareBeanPostProcessorAdapter has been deprecated
13-Jan-2019 20:01:05     public PropertyValues postProcessPropertyValues(
13-Jan-2019 20:01:05                           ^
13-Jan-2019 20:01:05 3 warnings
13-Jan-2019 20:01:06
13-Jan-2019 20:01:06 > Task :spring-batch-core:processResources
13-Jan-2019 20:01:06 > Task :spring-batch-core:classes
13-Jan-2019 20:01:06 > Task :spring-batch-core:jar
13-Jan-2019 20:01:08 warning: No processor claimed any of these annotations: org.springframework.integration.annotation.Payloads,org.springframework.messaging.handler.annotation.Header,org.springframework.integration.support.management.IntegrationManagedResource,org.springframework.integration.annotation.MessageEndpoint,org.springframework.integration.annotation.Aggregator,org.springframework.context.annotation.Import,org.springframework.beans.factory.annotation.Autowired,org.springframework.integration.config.EnableIntegration,org.springframework.integration.annotation.ServiceActivator,org.springframework.context.annotation.Configuration,org.springframework.lang.NonNullApi,org.springframework.lang.Nullable,org.springframework.context.annotation.Bean
13-Jan-2019 20:01:08 1 warning
13-Jan-2019 20:01:08
13-Jan-2019 20:01:08 > Task :spring-batch-integration:compileJava
13-Jan-2019 20:01:08
13-Jan-2019 20:01:08 > Task :spring-batch-integration:processResources
13-Jan-2019 20:01:08 > Task :spring-batch-integration:classes
13-Jan-2019 20:01:08 > Task :spring-batch-integration:jar
13-Jan-2019 20:01:17 /opt/bamboo-home/xml-data/build-dir/BATCH-NIGHTLY-JOB1/spring-batch-core/src/main/java/org/springframework/batch/core/jsr/launch/JsrJobOperator.java:182: warning - Tag @link: reference not found: javax.transaction.TransactionManager
13-Jan-2019 20:01:17
13-Jan-2019 20:01:17 > Task :api
13-Jan-2019 20:01:19 javadoc: warning - Tag @link: reference not found: PlayerSummary
13-Jan-2019 20:01:19 javadoc: warning - Tag @link: reference not found: PlayerSummary
13-Jan-2019 20:01:20 /opt/bamboo-home/xml-data/build-dir/BATCH-NIGHTLY-JOB1/spring-batch-infrastructure/src/main/java/org/springframework/batch/item/function/package-info.java:22: warning - Tag @link: reference not found: java.util.function
13-Jan-2019 20:01:20 /opt/bamboo-home/xml-data/build-dir/BATCH-NIGHTLY-JOB1/spring-batch-infrastructure/src/main/java/org/springframework/batch/item/function/package-info.java:22: warning - Tag @link: reference not found: java.util.function
13-Jan-2019 20:01:20 javadoc: warning - Tag @link: reference not found: PlayerSummary
13-Jan-2019 20:01:20 javadoc: warning - Tag @link: reference not found: PlayerSummary
13-Jan-2019 20:01:20 /opt/bamboo-home/xml-data/build-dir/BATCH-NIGHTLY-JOB1/spring-batch-infrastructure/src/main/java/org/springframework/batch/item/function/package-info.java:22: warning - Tag @link: reference not found: java.util.function
13-Jan-2019 20:01:20 javadoc: warning - Tag @link: reference not found: PlayerSummary
13-Jan-2019 20:01:20 javadoc: warning - Tag @link: reference not found: PlayerSummary
13-Jan-2019 20:01:20 /opt/bamboo-home/xml-data/build-dir/BATCH-NIGHTLY-JOB1/spring-batch-infrastructure/src/main/java/org/springframework/batch/item/function/package-info.java:22: warning - Tag @link: reference not found: java.util.function
13-Jan-2019 20:01:20 11 warnings
13-Jan-2019 20:01:25
13-Jan-2019 20:01:25 > Task :asciidoctor
13-Jan-2019 20:01:25 Converting /opt/bamboo-home/xml-data/build-dir/BATCH-NIGHTLY-JOB1/spring-batch-docs/asciidoc/repeat.adoc
13-Jan-2019 20:01:25 Converting /opt/bamboo-home/xml-data/build-dir/BATCH-NIGHTLY-JOB1/spring-batch-docs/asciidoc/schema-appendix.adoc
13-Jan-2019 20:01:25 Converting /opt/bamboo-home/xml-data/build-dir/BATCH-NIGHTLY-JOB1/spring-batch-docs/asciidoc/common-patterns.adoc
13-Jan-2019 20:01:26 Converting /opt/bamboo-home/xml-data/build-dir/BATCH-NIGHTLY-JOB1/spring-batch-docs/asciidoc/job.adoc
13-Jan-2019 20:01:26 Converting /opt/bamboo-home/xml-data/build-dir/BATCH-NIGHTLY-JOB1/spring-batch-docs/asciidoc/retry.adoc
13-Jan-2019 20:01:26 Converting /opt/bamboo-home/xml-data/build-dir/BATCH-NIGHTLY-JOB1/spring-batch-docs/asciidoc/step.adoc
13-Jan-2019 20:01:26 Converting /opt/bamboo-home/xml-data/build-dir/BATCH-NIGHTLY-JOB1/spring-batch-docs/asciidoc/transaction-appendix.adoc
13-Jan-2019 20:01:26 Converting /opt/bamboo-home/xml-data/build-dir/BATCH-NIGHTLY-JOB1/spring-batch-docs/asciidoc/domain.adoc
13-Jan-2019 20:01:26 Converting /opt/bamboo-home/xml-data/build-dir/BATCH-NIGHTLY-JOB1/spring-batch-docs/asciidoc/whatsnew.adoc
13-Jan-2019 20:01:26 Converting /opt/bamboo-home/xml-data/build-dir/BATCH-NIGHTLY-JOB1/spring-batch-docs/asciidoc/glossary.adoc
13-Jan-2019 20:01:27 Converting /opt/bamboo-home/xml-data/build-dir/BATCH-NIGHTLY-JOB1/spring-batch-docs/asciidoc/spring-batch-intro.adoc
13-Jan-2019 20:01:27 Converting /opt/bamboo-home/xml-data/build-dir/BATCH-NIGHTLY-JOB1/spring-batch-docs/asciidoc/toggle.adoc
13-Jan-2019 20:01:27 Converting /opt/bamboo-home/xml-data/build-dir/BATCH-NIGHTLY-JOB1/spring-batch-docs/asciidoc/spring-batch-integration.adoc
13-Jan-2019 20:01:27 Converting /opt/bamboo-home/xml-data/build-dir/BATCH-NIGHTLY-JOB1/spring-batch-docs/asciidoc/index.adoc
13-Jan-2019 20:01:27 Converting /opt/bamboo-home/xml-data/build-dir/BATCH-NIGHTLY-JOB1/spring-batch-docs/asciidoc/jsr-352.adoc
13-Jan-2019 20:01:27 Converting /opt/bamboo-home/xml-data/build-dir/BATCH-NIGHTLY-JOB1/spring-batch-docs/asciidoc/testing.adoc
13-Jan-2019 20:01:27 Converting /opt/bamboo-home/xml-data/build-dir/BATCH-NIGHTLY-JOB1/spring-batch-docs/asciidoc/scalability.adoc
13-Jan-2019 20:01:27 Converting /opt/bamboo-home/xml-data/build-dir/BATCH-NIGHTLY-JOB1/spring-batch-docs/asciidoc/index-single.adoc
13-Jan-2019 20:01:28 Converting /opt/bamboo-home/xml-data/build-dir/BATCH-NIGHTLY-JOB1/spring-batch-docs/asciidoc/appendix.adoc
13-Jan-2019 20:01:28 Converting /opt/bamboo-home/xml-data/build-dir/BATCH-NIGHTLY-JOB1/spring-batch-docs/asciidoc/readersAndWriters.adoc
13-Jan-2019 20:01:29 Converting /opt/bamboo-home/xml-data/build-dir/BATCH-NIGHTLY-JOB1/spring-batch-docs/asciidoc/repeat.adoc
13-Jan-2019 20:01:33 Converting /opt/bamboo-home/xml-data/build-dir/BATCH-NIGHTLY-JOB1/spring-batch-docs/asciidoc/schema-appendix.adoc
13-Jan-2019 20:01:36 Converting /opt/bamboo-home/xml-data/build-dir/BATCH-NIGHTLY-JOB1/spring-batch-docs/asciidoc/common-patterns.adoc
13-Jan-2019 20:01:40 Converting /opt/bamboo-home/xml-data/build-dir/BATCH-NIGHTLY-JOB1/spring-batch-docs/asciidoc/job.adoc
13-Jan-2019 20:01:46 Converting /opt/bamboo-home/xml-data/build-dir/BATCH-NIGHTLY-JOB1/spring-batch-docs/asciidoc/retry.adoc
13-Jan-2019 20:01:48 Converting /opt/bamboo-home/xml-data/build-dir/BATCH-NIGHTLY-JOB1/spring-batch-docs/asciidoc/step.adoc
13-Jan-2019 20:01:59 Converting /opt/bamboo-home/xml-data/build-dir/BATCH-NIGHTLY-JOB1/spring-batch-docs/asciidoc/transaction-appendix.adoc
13-Jan-2019 20:02:01 Converting /opt/bamboo-home/xml-data/build-dir/BATCH-NIGHTLY-JOB1/spring-batch-docs/asciidoc/domain.adoc
13-Jan-2019 20:02:03 Converting /opt/bamboo-home/xml-data/build-dir/BATCH-NIGHTLY-JOB1/spring-batch-docs/asciidoc/whatsnew.adoc
13-Jan-2019 20:02:05 Converting /opt/bamboo-home/xml-data/build-dir/BATCH-NIGHTLY-JOB1/spring-batch-docs/asciidoc/glossary.adoc
13-Jan-2019 20:02:05 Converting /opt/bamboo-home/xml-data/build-dir/BATCH-NIGHTLY-JOB1/spring-batch-docs/asciidoc/spring-batch-intro.adoc
13-Jan-2019 20:02:07 Converting /opt/bamboo-home/xml-data/build-dir/BATCH-NIGHTLY-JOB1/spring-batch-docs/asciidoc/toggle.adoc
13-Jan-2019 20:02:07 Converting /opt/bamboo-home/xml-data/build-dir/BATCH-NIGHTLY-JOB1/spring-batch-docs/asciidoc/spring-batch-integration.adoc
13-Jan-2019 20:02:19 Converting /opt/bamboo-home/xml-data/build-dir/BATCH-NIGHTLY-JOB1/spring-batch-docs/asciidoc/index.adoc
13-Jan-2019 20:02:20 Converting /opt/bamboo-home/xml-data/build-dir/BATCH-NIGHTLY-JOB1/spring-batch-docs/asciidoc/jsr-352.adoc
13-Jan-2019 20:02:22 Converting /opt/bamboo-home/xml-data/build-dir/BATCH-NIGHTLY-JOB1/spring-batch-docs/asciidoc/testing.adoc
13-Jan-2019 20:02:24 Converting /opt/bamboo-home/xml-data/build-dir/BATCH-NIGHTLY-JOB1/spring-batch-docs/asciidoc/scalability.adoc
13-Jan-2019 20:02:27 Converting /opt/bamboo-home/xml-data/build-dir/BATCH-NIGHTLY-JOB1/spring-batch-docs/asciidoc/index-single.adoc
13-Jan-2019 20:03:32 Converting /opt/bamboo-home/xml-data/build-dir/BATCH-NIGHTLY-JOB1/spring-batch-docs/asciidoc/appendix.adoc
13-Jan-2019 20:03:33 Converting /opt/bamboo-home/xml-data/build-dir/BATCH-NIGHTLY-JOB1/spring-batch-docs/asciidoc/readersAndWriters.adoc
13-Jan-2019 20:03:50
13-Jan-2019 20:03:50 > Task :docsZip
13-Jan-2019 20:03:50 > Task :schemaZip
13-Jan-2019 20:03:54 > Task :spring-batch-core:javadoc
13-Jan-2019 20:03:54 > Task :spring-batch-core:javadocJar
13-Jan-2019 20:03:54 > Task :spring-batch-core:sourcesJar
13-Jan-2019 20:03:57 > Task :spring-batch-infrastructure:javadoc
13-Jan-2019 20:03:58 > Task :spring-batch-infrastructure:javadocJar
13-Jan-2019 20:03:58 > Task :spring-batch-infrastructure:sourcesJar
13-Jan-2019 20:03:59 > Task :spring-batch-integration:javadoc
13-Jan-2019 20:03:59 > Task :spring-batch-integration:javadocJar
13-Jan-2019 20:03:59 > Task :spring-batch-integration:sourcesJar
13-Jan-2019 20:03:59
13-Jan-2019 20:03:59 > Task :spring-batch-test:compileJava
13-Jan-2019 20:03:59
13-Jan-2019 20:03:59 > Task :spring-batch-test:processResources
13-Jan-2019 20:03:59 > Task :spring-batch-test:classes
13-Jan-2019 20:03:59 > Task :spring-batch-test:jar
13-Jan-2019 20:03:59 /opt/users/bamboo/.gradle/caches/modules-2/files-2.1/org.springframework/spring-core/5.1.2.RELEASE/b9b00d4075c92761cfd4e527e0bdce1931b4f3dc/spring-core-5.1.2.RELEASE.jar(org/springframework/lang/Nullable.class): warning: Cannot find annotation method 'when()' in type 'Nonnull': class file for javax.annotation.Nonnull not found
13-Jan-2019 20:03:59 warning: unknown enum constant When.MAYBE
13-Jan-2019 20:03:59   reason: class file for javax.annotation.meta.When not found
13-Jan-2019 20:03:59 /opt/users/bamboo/.gradle/caches/modules-2/files-2.1/org.springframework/spring-core/5.1.2.RELEASE/b9b00d4075c92761cfd4e527e0bdce1931b4f3dc/spring-core-5.1.2.RELEASE.jar(org/springframework/lang/NonNullApi.class): warning: Cannot find annotation method 'value()' in type 'TypeQualifierDefault': class file for javax.annotation.meta.TypeQualifierDefault not found
13-Jan-2019 20:03:59 warning: No processor claimed any of these annotations: org.springframework.test.context.TestExecutionListeners,org.springframework.lang.NonNullApi,org.springframework.beans.factory.annotation.Autowired,org.springframework.lang.Nullable
13-Jan-2019 20:03:59 /opt/users/bamboo/.gradle/caches/modules-2/files-2.1/org.springframework/spring-core/5.1.2.RELEASE/b9b00d4075c92761cfd4e527e0bdce1931b4f3dc/spring-core-5.1.2.RELEASE.jar(org/springframework/lang/Nullable.class): warning: Cannot find annotation method 'when()' in type 'Nonnull': class file for javax.annotation.Nonnull not found
13-Jan-2019 20:03:59 warning: unknown enum constant When.MAYBE
13-Jan-2019 20:03:59   reason: class file for javax.annotation.meta.When not found
13-Jan-2019 20:03:59 /opt/users/bamboo/.gradle/caches/modules-2/files-2.1/org.springframework/spring-core/5.1.2.RELEASE/b9b00d4075c92761cfd4e527e0bdce1931b4f3dc/spring-core-5.1.2.RELEASE.jar(org/springframework/lang/NonNullApi.class): warning: Cannot find annotation method 'value()' in type 'TypeQualifierDefault': class file for javax.annotation.meta.TypeQualifierDefault not found
13-Jan-2019 20:03:59 /opt/users/bamboo/.gradle/caches/modules-2/files-2.1/org.springframework/spring-core/5.1.2.RELEASE/b9b00d4075c92761cfd4e527e0bdce1931b4f3dc/spring-core-5.1.2.RELEASE.jar(org/springframework/lang/Nullable.class): warning: Cannot find annotation method 'when()' in type 'Nonnull': class file for javax.annotation.Nonnull not found
13-Jan-2019 20:03:59 warning: unknown enum constant When.MAYBE
13-Jan-2019 20:03:59   reason: class file for javax.annotation.meta.When not found
13-Jan-2019 20:03:59 /opt/users/bamboo/.gradle/caches/modules-2/files-2.1/org.springframework/spring-core/5.1.2.RELEASE/b9b00d4075c92761cfd4e527e0bdce1931b4f3dc/spring-core-5.1.2.RELEASE.jar(org/springframework/lang/NonNullApi.class): warning: Cannot find annotation method 'value()' in type 'TypeQualifierDefault': class file for javax.annotation.meta.TypeQualifierDefault not found
13-Jan-2019 20:03:59 10 warnings
13-Jan-2019 20:04:01
13-Jan-2019 20:04:01 > Task :spring-batch-test:javadoc
13-Jan-2019 20:04:01 1 warning
13-Jan-2019 20:04:01
13-Jan-2019 20:04:01 > Task :spring-batch-test:javadocJar
13-Jan-2019 20:04:01 > Task :spring-batch-test:sourcesJar
13-Jan-2019 20:04:01 warning: unknown enum constant When.MAYBE
13-Jan-2019 20:04:01   reason: class file for javax.annotation.meta.When not found
13-Jan-2019 20:04:02 > Task :distZip
13-Jan-2019 20:04:02 > Task :assemble
13-Jan-2019 20:04:02 > Task :check UP-TO-DATE
13-Jan-2019 20:04:02 > Task :build
13-Jan-2019 20:04:02 > Task :spring-batch-core:assemble
13-Jan-2019 20:04:02 > Task :spring-batch-core:checkTestConfigs
13-Jan-2019 20:04:04
13-Jan-2019 20:04:04 > Task :spring-batch-core:compileTestJava
13-Jan-2019 20:04:04 warning: No processor claimed any of these annotations: org.springframework.test.annotation.DirtiesContext,org.springframework.batch.core.annotation.BeforeChunk,org.springframework.context.annotation.Primary,org.springframework.beans.factory.annotation.Autowired,org.aspectj.lang.annotation.AfterReturning,org.springframework.test.context.TestExecutionListeners,org.springframework.batch.core.configuration.annotation.StepScope,org.aspectj.lang.annotation.Aspect,org.junit.After,org.springframework.batch.core.annotation.AfterChunk,org.springframework.batch.core.annotation.BeforeRead,javax.annotation.Resource,org.springframework.context.annotation.ImportResource,javax.batch.api.BatchProperty,org.springframework.context.annotation.Configuration,org.springframework.batch.core.annotation.OnProcessError,org.springframework.batch.core.configuration.annotation.EnableBatchProcessing,org.springframework.batch.core.annotation.AfterJob,javax.annotation.PostConstruct,org.springframework.batch.core.annotation.OnReadError,org.junit.FixMethodOrder,org.springframework.batch.core.annotation.OnWriteError,org.springframework.batch.core.annotation.AfterStep,org.springframework.batch.core.annotation.AfterChunkError,org.junit.BeforeClass,org.springframework.batch.core.configuration.annotation.JobScope,org.mockito.Mock,org.junit.runner.RunWith,org.junit.runners.Parameterized.Parameters,org.springframework.context.annotation.Scope,org.springframework.beans.factory.annotation.Value,javax.inject.Inject,org.junit.runners.Suite.SuiteClasses,org.springframework.batch.core.annotation.BeforeStep,org.springframework.batch.core.annotation.BeforeJob,org.springframework.batch.core.annotation.AfterWrite,org.springframework.batch.core.annotation.BeforeWrite,org.springframework.beans.factory.annotation.Qualifier,org.junit.Before,org.springframework.core.annotation.Order,org.springframework.context.annotation.Import,org.junit.Test,org.springframework.batch.core.annotation.BeforeProcess,org.springframework.stereotype.Component,org.junit.Rule,org.springframework.batch.core.annotation.AfterProcess,org.junit.Ignore,org.springframework.test.context.ContextConfiguration,org.springframework.context.annotation.Bean,org.springframework.batch.core.annotation.AfterRead,org.springframework.transaction.annotation.Transactional
13-Jan-2019 20:04:05 1 warning
13-Jan-2019 20:04:06
13-Jan-2019 20:04:06 > Task :spring-batch-core:processTestResources
13-Jan-2019 20:04:06 > Task :spring-batch-core:testClasses
13-Jan-2019 20:04:36 > Task :spring-batch-core:test
13-Jan-2019 20:04:58 > Task :spring-batch-core:check
13-Jan-2019 20:04:58 > Task :spring-batch-core:build
13-Jan-2019 20:04:59 > Task :spring-batch-core-tests:compileJava
13-Jan-2019 20:04:59 > Task :spring-batch-core-tests:processResources
13-Jan-2019 20:04:59 > Task :spring-batch-core-tests:classes
13-Jan-2019 20:04:59 > Task :spring-batch-core-tests:jar
13-Jan-2019 20:05:00 > Task :spring-batch-core-tests:javadoc
13-Jan-2019 20:05:00 > Task :spring-batch-core-tests:javadocJar
13-Jan-2019 20:05:00 > Task :spring-batch-core-tests:sourcesJar
13-Jan-2019 20:05:00 > Task :spring-batch-core-tests:assemble
13-Jan-2019 20:05:00 > Task :spring-batch-core-tests:checkTestConfigs
13-Jan-2019 20:05:01
13-Jan-2019 20:05:01 > Task :spring-batch-core-tests:compileTestJava
13-Jan-2019 20:05:01
13-Jan-2019 20:05:01 > Task :spring-batch-core-tests:processTestResources
13-Jan-2019 20:05:01 > Task :spring-batch-core-tests:testClasses
13-Jan-2019 20:05:01 > Task :spring-batch-core-tests:test SKIPPED
13-Jan-2019 20:05:01 > Task :spring-batch-core-tests:check UP-TO-DATE
13-Jan-2019 20:05:01 > Task :spring-batch-core-tests:build
13-Jan-2019 20:05:01 warning: No processor claimed any of these annotations: org.springframework.test.annotation.DirtiesContext,org.junit.runner.RunWith,org.springframework.beans.factory.annotation.Autowired,org.junit.Test,org.springframework.context.annotation.Configuration,org.junit.runners.Suite.SuiteClasses,org.junit.Ignore,org.springframework.batch.core.configuration.annotation.EnableBatchProcessing,org.springframework.test.context.ContextConfiguration,org.junit.After,org.springframework.beans.factory.annotation.Qualifier,org.springframework.context.annotation.Bean,org.junit.Before
13-Jan-2019 20:05:01 1 warning
13-Jan-2019 20:05:01 > Task :spring-batch-docs:compileJava NO-SOURCE
13-Jan-2019 20:05:01 > Task :spring-batch-docs:processResources NO-SOURCE
13-Jan-2019 20:05:01 > Task :spring-batch-docs:classes UP-TO-DATE
13-Jan-2019 20:05:01 > Task :spring-batch-docs:jar
13-Jan-2019 20:05:01 > Task :spring-batch-docs:javadoc NO-SOURCE
13-Jan-2019 20:05:01 > Task :spring-batch-docs:javadocJar
13-Jan-2019 20:05:01 > Task :spring-batch-docs:sourcesJar
13-Jan-2019 20:05:01 > Task :spring-batch-docs:assemble
13-Jan-2019 20:05:01 > Task :spring-batch-docs:checkTestConfigs
13-Jan-2019 20:05:01 > Task :spring-batch-docs:compileTestJava NO-SOURCE
13-Jan-2019 20:05:01 > Task :spring-batch-docs:processTestResources NO-SOURCE
13-Jan-2019 20:05:01 > Task :spring-batch-docs:testClasses UP-TO-DATE
13-Jan-2019 20:05:01 > Task :spring-batch-docs:test NO-SOURCE
13-Jan-2019 20:05:01 > Task :spring-batch-docs:check UP-TO-DATE
13-Jan-2019 20:05:01 > Task :spring-batch-docs:build
13-Jan-2019 20:05:01 > Task :spring-batch-infrastructure:assemble
13-Jan-2019 20:05:01 > Task :spring-batch-infrastructure:checkTestConfigs
13-Jan-2019 20:05:03
13-Jan-2019 20:05:03 > Task :spring-batch-infrastructure:compileTestJava
13-Jan-2019 20:05:03 warning: No processor claimed any of these annotations: org.springframework.test.annotation.DirtiesContext,org.junit.BeforeClass,org.mockito.Mock,org.junit.runner.RunWith,org.springframework.beans.factory.annotation.Autowired,org.springframework.context.annotation.Scope,javax.validation.constraints.NotEmpty,javax.persistence.Table,org.junit.After,org.springframework.lang.Nullable,org.junit.Before,javax.persistence.Id,javax.persistence.Entity,org.springframework.batch.support.AnnotationMethodResolverTests.TestAnnotation,org.junit.AfterClass,org.springframework.test.context.transaction.AfterTransaction,org.junit.Test,javax.xml.bind.annotation.XmlRootElement,org.springframework.context.annotation.Configuration,org.junit.Rule,org.junit.Ignore,org.springframework.test.context.ContextConfiguration,org.springframework.context.annotation.Bean,org.springframework.transaction.annotation.Transactional
13-Jan-2019 20:05:04 1 warning
13-Jan-2019 20:05:04
13-Jan-2019 20:05:04 > Task :spring-batch-infrastructure:processTestResources
13-Jan-2019 20:05:04 > Task :spring-batch-infrastructure:testClasses
13-Jan-2019 20:05:09
13-Jan-2019 20:05:09 > Task :spring-batch-infrastructure:test
13-Jan-2019 20:05:09 Java HotSpot(TM) 64-Bit Server VM warning: ignoring option MaxPermSize=256m; support was removed in 8.0
13-Jan-2019 20:05:58
13-Jan-2019 20:05:58 > Task :spring-batch-infrastructure:check
13-Jan-2019 20:05:58 > Task :spring-batch-infrastructure:build
13-Jan-2019 20:05:58 > Task :spring-batch-infrastructure-tests:compileJava
13-Jan-2019 20:05:58 > Task :spring-batch-infrastructure-tests:processResources NO-SOURCE
13-Jan-2019 20:05:58 > Task :spring-batch-infrastructure-tests:classes
13-Jan-2019 20:05:58 > Task :spring-batch-infrastructure-tests:jar
13-Jan-2019 20:05:59 > Task :spring-batch-infrastructure-tests:javadoc
13-Jan-2019 20:05:59 > Task :spring-batch-infrastructure-tests:javadocJar
13-Jan-2019 20:05:59 > Task :spring-batch-infrastructure-tests:sourcesJar
13-Jan-2019 20:05:59 > Task :spring-batch-infrastructure-tests:assemble
13-Jan-2019 20:05:59 > Task :spring-batch-infrastructure-tests:checkTestConfigs
13-Jan-2019 20:06:01
13-Jan-2019 20:06:01 > Task :spring-batch-infrastructure-tests:compileTestJava
13-Jan-2019 20:06:01 warning: No processor claimed any of these annotations: org.springframework.test.annotation.DirtiesContext,javax.xml.bind.annotation.XmlAccessorType,javax.persistence.Entity,org.junit.AfterClass,org.springframework.test.context.transaction.AfterTransaction,org.junit.BeforeClass,org.junit.runner.RunWith,org.springframework.beans.factory.annotation.Autowired,org.junit.Test,javax.xml.bind.annotation.XmlRootElement,org.junit.Rule,javax.xml.bind.annotation.XmlType,javax.persistence.Table,org.junit.Ignore,org.springframework.test.context.ContextConfiguration,org.junit.After,org.springframework.transaction.annotation.Transactional,org.junit.Before,org.springframework.test.context.transaction.BeforeTransaction,javax.xml.bind.annotation.XmlElement,javax.persistence.Id
13-Jan-2019 20:06:01 1 warning
13-Jan-2019 20:06:02
13-Jan-2019 20:06:02 > Task :spring-batch-infrastructure-tests:processTestResources
13-Jan-2019 20:06:02 > Task :spring-batch-infrastructure-tests:testClasses
13-Jan-2019 20:06:02 > Task :spring-batch-infrastructure-tests:test SKIPPED
13-Jan-2019 20:06:02 > Task :spring-batch-infrastructure-tests:check UP-TO-DATE
13-Jan-2019 20:06:02 > Task :spring-batch-infrastructure-tests:build
13-Jan-2019 20:06:02 > Task :spring-batch-integration:assemble
13-Jan-2019 20:06:02 > Task :spring-batch-integration:checkTestConfigs
13-Jan-2019 20:06:04
13-Jan-2019 20:06:04 > Task :spring-batch-integration:compileTestJava
13-Jan-2019 20:06:04 warning: No processor claimed any of these annotations: org.springframework.test.annotation.DirtiesContext,org.springframework.messaging.handler.annotation.Header,org.junit.BeforeClass,org.springframework.integration.annotation.MessageEndpoint,org.mockito.Mock,org.junit.runner.RunWith,org.springframework.beans.factory.annotation.Autowired,org.junit.Test,org.springframework.integration.annotation.Splitter,org.springframework.integration.annotation.ServiceActivator,org.springframework.context.annotation.Configuration,org.springframework.test.context.TestExecutionListeners,org.junit.runners.Suite.SuiteClasses,org.springframework.stereotype.Component,org.junit.Rule,org.springframework.batch.core.configuration.annotation.EnableBatchProcessing,org.junit.Ignore,org.springframework.test.context.ContextConfiguration,org.junit.After,org.springframework.beans.factory.annotation.Qualifier,org.junit.Before
13-Jan-2019 20:06:04 1 warning
13-Jan-2019 20:06:04
13-Jan-2019 20:06:04 > Task :spring-batch-integration:processTestResources
13-Jan-2019 20:06:04 > Task :spring-batch-integration:testClasses
13-Jan-2019 20:06:34 > Task :spring-batch-integration:test
13-Jan-2019 20:06:38 > Task :spring-batch-integration:check
13-Jan-2019 20:06:38 > Task :spring-batch-integration:build
13-Jan-2019 20:06:39
13-Jan-2019 20:06:39 > Task :spring-batch-samples:compileJava
13-Jan-2019 20:06:39
13-Jan-2019 20:06:39 > Task :spring-batch-samples:processResources
13-Jan-2019 20:06:39 warning: No processor claimed any of these annotations: org.springframework.batch.integration.config.annotation.EnableBatchIntegration,javax.persistence.Entity,org.springframework.context.annotation.PropertySource,org.springframework.beans.factory.annotation.Autowired,org.springframework.context.annotation.Import,org.springframework.integration.config.EnableIntegration,javax.batch.api.BatchProperty,javax.validation.constraints.NotEmpty,org.springframework.context.annotation.Configuration,org.springframework.beans.factory.annotation.Value,javax.inject.Inject,org.springframework.batch.core.annotation.BeforeStep,javax.persistence.Table,org.springframework.batch.core.annotation.AfterWrite,org.springframework.batch.core.configuration.annotation.EnableBatchProcessing,org.springframework.batch.core.configuration.annotation.StepScope,javax.annotation.PostConstruct,org.springframework.context.annotation.Bean,javax.persistence.Id
13-Jan-2019 20:06:39 1 warning
13-Jan-2019 20:06:39 > Task :spring-batch-samples:classes
13-Jan-2019 20:06:39 > Task :spring-batch-samples:jar
13-Jan-2019 20:06:41 > Task :spring-batch-samples:javadoc
13-Jan-2019 20:06:41 > Task :spring-batch-samples:javadocJar
13-Jan-2019 20:06:41 > Task :spring-batch-samples:sourcesJar
13-Jan-2019 20:06:41 > Task :spring-batch-samples:assemble
13-Jan-2019 20:06:41 > Task :spring-batch-samples:checkTestConfigs
13-Jan-2019 20:06:43
13-Jan-2019 20:06:43 > Task :spring-batch-samples:compileTestJava
13-Jan-2019 20:06:43 warning: No processor claimed any of these annotations: org.springframework.batch.core.annotation.AfterStep,org.junit.BeforeClass,org.junit.runner.RunWith,org.springframework.batch.core.annotation.OnSkipInProcess,org.springframework.context.annotation.PropertySource,org.springframework.beans.factory.annotation.Autowired,org.springframework.beans.factory.annotation.Value,org.springframework.test.context.TestExecutionListeners,org.junit.runners.Suite.SuiteClasses,org.springframework.batch.core.annotation.BeforeStep,org.junit.After,org.springframework.beans.factory.annotation.Qualifier,org.junit.Before,org.springframework.test.context.transaction.BeforeTransaction,org.junit.AfterClass,org.springframework.test.context.transaction.AfterTransaction,org.junit.Test,org.springframework.context.annotation.Configuration,org.springframework.batch.core.configuration.annotation.EnableBatchProcessing,org.junit.Ignore,org.springframework.test.context.ContextConfiguration,org.springframework.context.annotation.Bean,org.springframework.batch.core.annotation.OnSkipInWrite,org.springframework.transaction.annotation.Transactional
13-Jan-2019 20:06:43 1 warning
13-Jan-2019 20:06:44
13-Jan-2019 20:06:44 > Task :spring-batch-samples:processTestResources
13-Jan-2019 20:06:44 > Task :spring-batch-samples:testClasses
13-Jan-2019 20:06:58
13-Jan-2019 20:06:58 > Task :spring-batch-samples:test
13-Jan-2019 20:06:58
13-Jan-2019 20:06:58 org.springframework.batch.sample.JobOperatorFunctionalTests > testMultipleSimultaneousInstances FAILED
13-Jan-2019 20:06:58     java.lang.AssertionError at JobOperatorFunctionalTests.java:134
13-Jan-2019 20:07:29
13-Jan-2019 20:07:29 128 tests completed, 1 failed
13-Jan-2019 20:07:29
13-Jan-2019 20:07:29 > Task :spring-batch-samples:test FAILED
13-Jan-2019 20:07:29
13-Jan-2019 20:07:29 Deprecated Gradle features were used in this build, making it incompatible with Gradle 5.0.
13-Jan-2019 20:07:29 Use '--warning-mode all' to show the individual deprecation warnings.
13-Jan-2019 20:07:29 See https://docs.gradle.org/4.10/userguide/command_line_interface.html#sec:command_line_warnings
13-Jan-2019 20:07:29 81 actionable tasks: 72 executed, 9 up-to-date
13-Jan-2019 20:07:29
13-Jan-2019 20:07:29 FAILURE: Build failed with an exception.
13-Jan-2019 20:07:29
13-Jan-2019 20:07:29 * What went wrong:
13-Jan-2019 20:07:29 Execution failed for task ':spring-batch-samples:test'.
13-Jan-2019 20:07:29 > There were failing tests. See the report at: file:///opt/bamboo-home/xml-data/build-dir/BATCH-NIGHTLY-JOB1/spring-batch-samples/build/reports/tests/test/index.html
13-Jan-2019 20:07:29
13-Jan-2019 20:07:29 * Try:
13-Jan-2019 20:07:29 Run with --stacktrace option to get the stack trace. Run with --info or --debug option to get more log output. Run with --scan to get full insights.
13-Jan-2019 20:07:29
13-Jan-2019 20:07:29 * Get more help at https://help.gradle.org
13-Jan-2019 20:07:29
13-Jan-2019 20:07:29 BUILD FAILED in 7m 14s
13-Jan-2019 20:07:29
13-Jan-2019 20:07:29 Failing task since return code of [./gradlew clean build dist jacocoTestReport runTck -I /tmp/artifactory.init.script2214020899050590661gradle -DbuildInfoConfig.propertiesFile=/tmp/buildinfo6283918036178226621properties artifactoryPublish -Dartifactory.resolve.password=******** -Dartifactory.publish.password=********] was 1 while expected 0
13-Jan-2019 20:07:29 Finished task 'Nightly Snapshot' with result: Failed
13-Jan-2019 20:07:29 Running post build plugin 'Docker Container Cleanup'
13-Jan-2019 20:07:29 Running post build plugin 'NCover Results Collector'
13-Jan-2019 20:07:29 Running post build plugin 'Artifactory Release Management Staging'
13-Jan-2019 20:07:29 Running post build plugin 'Artifactory Build Info Copier'
13-Jan-2019 20:07:29 Running post build plugin 'Artifactory Gradle Properties Info Copier'
13-Jan-2019 20:07:29 Running post build plugin 'Clover Results Collector'
13-Jan-2019 20:07:29 Running post build plugin 'npm Cache Cleanup'
13-Jan-2019 20:07:29 Running post build plugin 'Artifact Copier'
13-Jan-2019 20:07:30 Successfully removed working directory at '/opt/bamboo-home/xml-data/build-dir/BATCH-NIGHTLY-JOB1'
13-Jan-2019 20:07:30 Finalising the build...
13-Jan-2019 20:07:30 Stopping timer.
13-Jan-2019 20:07:30 Build BATCH-NIGHTLY-JOB1-4312 completed.
13-Jan-2019 20:07:30 Running on server: post build plugin 'NCover Results Collector'
13-Jan-2019 20:07:30 Running on server: post build plugin 'Build Hanging Detection Configuration'
13-Jan-2019 20:07:30 Running on server: post build plugin 'Clover Delta Calculator'
13-Jan-2019 20:07:30 Running on server: post build plugin 'Maven Dependencies Postprocessor'
13-Jan-2019 20:07:30 All post build plugins have finished
13-Jan-2019 20:07:30 Generating build results summary...
13-Jan-2019 20:07:30 Saving build results to disk...
13-Jan-2019 20:07:30 Logging substituted variables...
13-Jan-2019 20:07:30 Indexing build results...
13-Jan-2019 20:07:30 Finished building BATCH-NIGHTLY-JOB1-4312.