Build #216

Build: #216 failed Scheduled

Logs

The following logs have been generated by the jobs in this branch.
  • Expand all
  • Collapse all
Job Logs
Collapse Default Job Default Stage Download or View
16-May-2020 20:03:20
16-May-2020 20:03:20 org.springframework.batch.core.jsr.step.DecisionStepTests > testDecisionAfterSplit FAILED
16-May-2020 20:03:20     java.lang.AssertionError at DecisionStepTests.java:113
16-May-2020 20:03:27
16-May-2020 20:03:27 1914 tests completed, 1 failed, 7 skipped
16-May-2020 20:03:28
16-May-2020 20:03:28 FAILURE: Build failed with an exception.
16-May-2020 20:03:28
16-May-2020 20:03:28 * What went wrong:
16-May-2020 20:03:28 Execution failed for task ':spring-batch-core:test'.
16-May-2020 20:03:28 > There were failing tests. See the report at: file:///opt/bamboo-home/xml-data/build-dir/BATCH-NIGHTLY4-JOB1/spring-batch-core/build/reports/tests/test/index.html
16-May-2020 20:03:28
16-May-2020 20:03:28 * Try:
16-May-2020 20:03:28 Run with --stacktrace option to get the stack trace. Run with --info or --debug option to get more log output. Run with --scan to get full insights.
16-May-2020 20:03:28
16-May-2020 20:03:28 * Get more help at https://help.gradle.org
16-May-2020 20:03:28
16-May-2020 20:03:28 BUILD FAILED in 3m 23s
16-May-2020 20:03:28
16-May-2020 20:03:28 > Task :spring-batch-core:test FAILED
16-May-2020 20:03:28
16-May-2020 20:03:28 Deprecated Gradle features were used in this build, making it incompatible with Gradle 7.0.
16-May-2020 20:03:28 Use '--warning-mode all' to show the individual deprecation warnings.
16-May-2020 20:03:28 See https://docs.gradle.org/6.0.1/userguide/command_line_interface.html#sec:command_line_warnings
16-May-2020 20:03:28 44 actionable tasks: 35 executed, 9 up-to-date