Build #222

Build: #222 failed Scheduled

Build result summary

Details

Completed
Duration
3 minutes
Labels
None
Agent
bamboo-12.af.pivotal.io
Revision
771bb5d45d8894db97454cee02c3793b78364713 771bb5d45d8894db97454cee02c3793b78364713
Total tests
1914
Failing since
#221 (Scheduled – )
Fixed in
#223 (Scheduled)

Responsible

This build has been failing since #221
No one has taken responsibility

Tests

New test failures 1
Status Test View job Duration
Collapse Failed JsrSplitParsingTests test History
Default Job < 1 sec
java.lang.AssertionError: java.lang.AssertionError: expected:<COMPLETED> but was:<FAILED>
java.lang.AssertionError: expected:<COMPLETED> but was:<FAILED>
	at org.junit.Assert.fail(Assert.java:89)
	at org.junit.Assert.failNotEquals(Assert.java:835)
	at org.junit.Assert.assertEquals(Assert.java:120)
	at org.junit.Assert.assertEquals(Assert.java:146)
	at org.springframework.batch.core.jsr.configuration.xml.JsrSplitParsingTests.test(JsrSplitParsingTests.java:49)
	at sun.reflect.NativeMethodAccessorImpl.invoke0(Native Method)
(48 more lines...)
Fixed tests 1
Status Test Failing since View job Duration
Successful OptimisticLockingFailureTests testAsyncStopOfStartingJob History
Failing since build #221 (Scheduled) Default Job 4 secs