Build #222

Build: #222 failed Scheduled

Logs

The following logs have been generated by the jobs in this branch.
  • Expand all
  • Collapse all
Job Logs
Collapse Default Job Default Stage Download or View
22-May-2020 20:03:14
22-May-2020 20:03:14 org.springframework.batch.core.jsr.configuration.xml.JsrSplitParsingTests > test FAILED
22-May-2020 20:03:14     java.lang.AssertionError at JsrSplitParsingTests.java:49
22-May-2020 20:03:19
22-May-2020 20:03:19 1914 tests completed, 1 failed, 7 skipped
22-May-2020 20:03:19
22-May-2020 20:03:19 FAILURE: Build failed with an exception.
22-May-2020 20:03:19
22-May-2020 20:03:19 * What went wrong:
22-May-2020 20:03:19 Execution failed for task ':spring-batch-core:test'.
22-May-2020 20:03:19 > There were failing tests. See the report at: file:///opt/bamboo-home/xml-data/build-dir/BATCH-NIGHTLY4-JOB1/spring-batch-core/build/reports/tests/test/index.html
22-May-2020 20:03:19
22-May-2020 20:03:19 * Try:
22-May-2020 20:03:19 Run with --stacktrace option to get the stack trace. Run with --info or --debug option to get more log output. Run with --scan to get full insights.
22-May-2020 20:03:19
22-May-2020 20:03:19 * Get more help at https://help.gradle.org
22-May-2020 20:03:19
22-May-2020 20:03:19 BUILD FAILED in 3m 14s
22-May-2020 20:03:19
22-May-2020 20:03:19 > Task :spring-batch-core:test FAILED
22-May-2020 20:03:19
22-May-2020 20:03:19 Deprecated Gradle features were used in this build, making it incompatible with Gradle 7.0.
22-May-2020 20:03:19 Use '--warning-mode all' to show the individual deprecation warnings.
22-May-2020 20:03:19 See https://docs.gradle.org/6.0.1/userguide/command_line_interface.html#sec:command_line_warnings
22-May-2020 20:03:19 44 actionable tasks: 35 executed, 9 up-to-date