Build #222

Build: #222 failed Scheduled

Test results

  • 1,914 tests in total
  • 1 test failed
  • 1 failure is new
  • 1 test was fixed
  • 7 tests were quarantined / skipped
  • 45 seconds taken in total.
New test failures 1
Status Test View job Duration
Collapse Failed JsrSplitParsingTests test History
Default Job < 1 sec
java.lang.AssertionError: java.lang.AssertionError: expected:<COMPLETED> but was:<FAILED>
java.lang.AssertionError: expected:<COMPLETED> but was:<FAILED>
	at org.junit.Assert.fail(Assert.java:89)
	at org.junit.Assert.failNotEquals(Assert.java:835)
	at org.junit.Assert.assertEquals(Assert.java:120)
	at org.junit.Assert.assertEquals(Assert.java:146)
	at org.springframework.batch.core.jsr.configuration.xml.JsrSplitParsingTests.test(JsrSplitParsingTests.java:49)
	at sun.reflect.NativeMethodAccessorImpl.invoke0(Native Method)
(48 more lines...)
Fixed tests 1
Status Test Failing since View job Duration
Successful OptimisticLockingFailureTests testAsyncStopOfStartingJob History
Failing since build #221 (Scheduled) Default Job 4 secs
Skipped tests 7
Status Test Failing since View job
Skipped ItemListenerErrorTests testOnReadError History

Passing on the master branch.

Default Job
Skipped JobRepositoryFactoryBeanTests testTransactionAttributesForCreateMethodNullHypothesis History

Passing on the master branch.

Default Job
Skipped StepScopeClassIntegrationTests testSimpleValue History

Passing on the master branch.

Default Job
Skipped StepScopeClassIntegrationTests testNested History

Passing on the master branch.

Default Job
Skipped FaultTolerantStepFactoryBeanUnexpectedRollbackTests testTransactionException History

Passing on the master branch.

Default Job
Skipped AsyncChunkOrientedStepIntegrationTests testStatus History

Passing on the master branch.

Default Job
Skipped ChunkOrientedStepIntegrationTests testStatusForCommitFailedException History

Passing on the master branch.

Default Job